{"text_format":"1","workbook":"xlsx","n_sheets":4,"sheets":["Instructions","FY1400_YTD_Actual","Charts","Targets & historical"],"not_rendered":{"charts":12,"images":0,"macros":1,"external_links":0,"defined_names":1,"comments":0,"pivot_tables":0},"unopened":[],"bounds":{"document_bytes":16777216,"sheet_cells":100000,"rows_first":2000,"rows_last":500,"rows_between":2000,"halvings":0,"cell_chars":16384,"cell_head_chars":4096},"cells_cut":0,"cells_raw":0,"read":"whole","date_system":"1900"}

{"sheet":"Instructions","index":0,"n_rows":15,"n_cols":4,"rows_kept":15,"cut":false,"hidden":false,"merged":[]}
[]
[]
[]
[]
[]
[null,null,null,"Instructions:"]
[]
[null,null,null,"1. Insert YTD actual data in yellow shaded area of YTD_Actual_Data sheet for each tax type and tax collectorate"]
[null,null,null,"2. Select charts for Page 1 using cell B2 to B5 and for Page 2 using cell B78 to B85 in Charts sheet"]
[null,null,null,"3. Pick a historical year other than previous year using cell B10 to compare against"]
{"$rows_left_out":6}
{"sheet":"FY1400_YTD_Actual","index":1,"n_rows":29,"n_cols":27,"rows_kept":29,"cut":false,"hidden":false,"merged":[[28,1,32,13],[28,0,32,0],[0,1,1,1],[0,2,1,2],[0,3,1,3],[0,4,1,4],[0,5,1,5],[0,6,1,6],[0,7,1,7],[0,8,1,8],[0,9,1,9],[0,10,1,10],[0,11,1,11],[0,12,1,12],[0,13,1,13],[0,0,1,0]]}
[{"$f":"'Targets & historical'!C97","v":"Actual"},"M1","M2","M3","M4","M5","M6","M7","M8","M9","M10","M11","M12","Total"]
[]
[{"$f":"'Targets & historical'!B3","v":"Customs Department"},{"$f":"SUM(B4:B9)","v":6636.8387839999996},{"$f":"SUM(C4:C9)","v":5335.9909640000005},{"$f":"SUM(D4:D9)","v":5954.1943460000002},{"$f":"SUM(E4:E9)","v":1180.7466020000002},{"$f":"SUM(F4:F9)","v":0},{"$f":"SUM(G4:G9)","v":0},{"$f":"SUM(H4:H9)","v":0},{"$f":"SUM(I4:I9)","v":0},{"$f":"SUM(J4:J9)","v":0},{"$f":"SUM(K4:K9)","v":0},{"$f":"SUM(L4:L9)","v":0},{"$f":"SUM(M4:M9)","v":0},{"$f":"SUM(N4:N9)","v":19107.770696}]
[{"$f":"'Targets & historical'!B4","v":"Herat Customs Office"},1643.526719,1445.6511310000001,761.866716,274.03972599999997,0,0,0,0,0,0,0,0,{"$f":"SUM(B4:M4)","v":4125.0842919999996}]
[{"$f":"'Targets & historical'!B5","v":"Nangarhar Customs Office"},1054.4726489999998,920.44798600000001,1084.362517,227.10718099999997,0,0,0,0,0,0,0,0,3286.3903329999998]
[{"$f":"'Targets & historical'!B6","v":"Balkh Customs Office"},1164.2283010000001,720.25954300000001,1001.177501,201.19506799999999,0,0,0,0,0,0,0,0,3086.8604130000003]
[{"$f":"'Targets & historical'!B7","v":"Kandahar Customs Office"},755.12235299999998,622.18026599999996,1137.2866240000001,197.51063200000004,0,0,0,0,0,0,0,0,2712.0998750000003]
[{"$f":"'Targets & historical'!B8","v":"Nimroz Customs Office"},644.42951000000005,534.69314399999996,757.221452,160.97738000000001,0,0,0,0,0,0,0,0,2097.3214859999998]
[{"$f":"'Targets & historical'!B9","v":"Other Customs Offices"},1375.059252,1092.7588940000001,1212.279536,119.91661499999999,0,0,0,0,0,0,0,0,3800.0142970000002]
[{"$f":"'Targets & historical'!B10","v":"Afghanistan Revenue Department"},{"$f":"SUM(B11:B16)","v":6423.4511258599996},{"$f":"SUM(C11:C16)","v":5298.2929259100001},7907.1048461999999,327.04374009999998,0,0,0,0,0,0,0,0,{"$f":"SUM(N11:N16)","v":19955.89263807}]
{"$rows_left_out":20}
{"sheet":"Charts","index":2,"n_rows":113,"n_cols":55,"rows_kept":113,"cut":false,"hidden":false,"merged":[[76,0,76,1],[0,3,2,18],[73,3,76,18],[0,0,0,1],[3,3,3,18],[4,17,4,18]]}
["Select charts for page 1:",null,null,"Ministry of Finance",null,null,null,null,null,null,null,null,null,null,null,null,null,null,null,null,null,null,null,null,null,null,null,null,null,null,"M1","M2","M3","M4","M5","M6","M7","M8","M9","M10","M11","M12"]
["Figure 1:","Total Revenues",{"$f":"A2&\" \"&B2","v":"Figure 1: Total Revenues"},null,null,null,null,null,null,null,null,null,null,null,null,null,null,null,null,null,null,null,null,null,null,null,null,null,{"$f":"A2","v":"Figure 1:"},{"$f":"FY1400_YTD_Actual!$A$1","v":"Actual"},{"$f":"IF(INDEX(FY1400_YTD_Actual!B$3:B$20,MATCH($B$2,FY1400_YTD_Actual!$A$3:$A$20,0))=0,#N/A,INDEX(FY1400_YTD_Actual!B$3:B$20,MATCH($B$2,FY1400_YTD_Actual!$A$3:$A$20,0)))","v":13060.289909859999},{"$f":"IF(INDEX(FY1400_YTD_Actual!C$3:C$20,MATCH($B$2,FY1400_YTD_Actual!$A$3:$A$20,0))=0,#N/A,INDEX(FY1400_YTD_Actual!C$3:C$20,MATCH($B$2,FY1400_YTD_Actual!$A$3:$A$20,0)))","v":10634.283889910001},{"$f":"IF(INDEX(FY1400_YTD_Actual!D$3:D$20,MATCH($B$2,FY1400_YTD_Actual!$A$3:$A$20,0))=0,#N/A,INDEX(FY1400_YTD_Actual!D$3:D$20,MATCH($B$2,FY1400_YTD_Actual!$A$3:$A$20,0)))","v":13861.2991922},{"$f":"IF(INDEX(FY1400_YTD_Actual!E$3:E$20,MATCH($B$2,FY1400_YTD_Actual!$A$3:$A$20,0))=0,#N/A,INDEX(FY1400_YTD_Actual!E$3:E$20,MATCH($B$2,FY1400_YTD_Actual!$A$3:$A$20,0)))","v":1507.7903421000001},{"$f":"IF(INDEX(FY1400_YTD_Actual!F$3:F$20,MATCH($B$2,FY1400_YTD_Actual!$A$3:$A$20,0))=0,#N/A,INDEX(FY1400_YTD_Actual!F$3:F$20,MATCH($B$2,FY1400_YTD_Actual!$A$3:$A$20,0)))","v":{"$error":"#N/A"}},{"$f":"IF(INDEX(FY1400_YTD_Actual!G$3:G$20,MATCH($B$2,FY1400_YTD_Actual!$A$3:$A$20,0))=0,#N/A,INDEX(FY1400_YTD_Actual!G$3:G$20,MATCH($B$2,FY1400_YTD_Actual!$A$3:$A$20,0)))","v":{"$error":"#N/A"}},{"$f":"IF(INDEX(FY1400_YTD_Actual!H$3:H$20,MATCH($B$2,FY1400_YTD_Actual!$A$3:$A$20,0))=0,#N/A,INDEX(FY1400_YTD_Actual!H$3:H$20,MATCH($B$2,FY1400_YTD_Actual!$A$3:$A$20,0)))","v":{"$error":"#N/A"}},{"$f":"IF(INDEX(FY1400_YTD_Actual!I$3:I$20,MATCH($B$2,FY1400_YTD_Actual!$A$3:$A$20,0))=0,#N/A,INDEX(FY1400_YTD_Actual!I$3:I$20,MATCH($B$2,FY1400_YTD_Actual!$A$3:$A$20,0)))","v":{"$error":"#N/A"}},{"$f":"IF(INDEX(FY1400_YTD_Actual!J$3:J$20,MATCH($B$2,FY1400_YTD_Actual!$A$3:$A$20,0))=0,#N/A,INDEX(FY1400_YTD_Actual!J$3:J$20,MATCH($B$2,FY1400_YTD_Actual!$A$3:$A$20,0)))","v":{"$error":"#N/A"}},{"$f":"IF(INDEX(FY1400_YTD_Actual!K$3:K$20,MATCH($B$2,FY1400_YTD_Actual!$A$3:$A$20,0))=0,#N/A,INDEX(FY1400_YTD_Actual!K$3:K$20,MATCH($B$2,FY1400_YTD_Actual!$A$3:$A$20,0)))","v":{"$error":"#N/A"}},{"$f":"IF(INDEX(FY1400_YTD_Actual!L$3:L$20,MATCH($B$2,FY1400_YTD_Actual!$A$3:$A$20,0))=0,#N/A,INDEX(FY1400_YTD_Actual!L$3:L$20,MATCH($B$2,FY1400_YTD_Actual!$A$3:$A$20,0)))","v":{"$error":"#N/A"}},{"$f":"IF(INDEX(FY1400_YTD_Actual!M$3:M$20,MATCH($B$2,FY1400_YTD_Actual!$A$3:$A$20,0))=0,#N/A,INDEX(FY1400_YTD_Actual!M$3:M$20,MATCH($B$2,FY1400_YTD_Actual!$A$3:$A$20,0)))","v":{"$error":"#N/A"}}]
["Figure 2:","Tax Revenues",{"$f":"A3&\" \"&B3","v":"Figure 2: Tax Revenues"},null,null,null,null,null,null,null,null,null,null,null,null,null,null,null,null,null,null,null,null,null,null,null,null,null,{"$f":"AD3&$B$2","v":"FY1399 TargetsTotal Revenues"},{"$f":"'Targets & historical'!$C$94","v":"FY1399 Targets"},{"$f":"INDEX('Targets & historical'!C$3:C$41,MATCH(Charts!$AC3,'Targets & historical'!$A$3:$A$41,0))","v":12979.40000020148},{"$f":"INDEX('Targets & historical'!D$3:D$41,MATCH(Charts!$AC3,'Targets & historical'!$A$3:$A$41,0))","v":12979.40000020148},{"$f":"INDEX('Targets & historical'!E$3:E$41,MATCH(Charts!$AC3,'Targets & historical'!$A$3:$A$41,0))","v":12979.40000020148},{"$f":"INDEX('Targets & historical'!F$3:F$41,MATCH(Charts!$AC3,'Targets & historical'!$A$3:$A$41,0))","v":14520.333333558734},{"$f":"INDEX('Targets & historical'!G$3:G$41,MATCH(Charts!$AC3,'Targets & historical'!$A$3:$A$41,0))","v":14520.333333558734},{"$f":"INDEX('Targets & historical'!H$3:H$41,MATCH(Charts!$AC3,'Targets & historical'!$A$3:$A$41,0))","v":14520.333333558734},{"$f":"INDEX('Targets & historical'!I$3:I$41,MATCH(Charts!$AC3,'Targets & historical'!$A$3:$A$41,0))","v":15172.266666902187},{"$f":"INDEX('Targets & historical'!J$3:J$41,MATCH(Charts!$AC3,'Targets & historical'!$A$3:$A$41,0))","v":15172.266666902187},{"$f":"INDEX('Targets & historical'!K$3:K$41,MATCH(Charts!$AC3,'Targets & historical'!$A$3:$A$41,0))","v":15172.266666902187},{"$f":"INDEX('Targets & historical'!L$3:L$41,MATCH(Charts!$AC3,'Targets & historical'!$A$3:$A$41,0))","v":16594.666666924266},{"$f":"INDEX('Targets & historical'!M$3:M$41,MATCH(Charts!$AC3,'Targets & historical'!$A$3:$A$41,0))","v":16594.666666924266},{"$f":"INDEX('Targets & historical'!N$3:N$41,MATCH(Charts!$AC3,'Targets & historical'!$A$3:$A$41,0))","v":16594.666666924266}]
["Figure 3:","Customs Revenues","Figure 3: Customs Revenues","YTD Revenue",null,null,null,null,null,null,null,null,null,null,null,null,null,null,null,null,null,null,null,null,null,null,null,"FY1398",{"$f":"AD4&$B$2","v":"FY1398Total Revenues"},{"$f":"'Targets & historical'!$C$95","v":"FY1398"},{"$f":"INDEX('Targets & historical'!C$3:C$41,MATCH(Charts!$AC4,'Targets & historical'!$A$3:$A$41,0))","v":14436.95750846},{"$f":"INDEX('Targets & historical'!D$3:D$41,MATCH(Charts!$AC4,'Targets & historical'!$A$3:$A$41,0))","v":13504.980021540001},{"$f":"INDEX('Targets & historical'!E$3:E$41,MATCH(Charts!$AC4,'Targets & historical'!$A$3:$A$41,0))","v":14225.514799649998},{"$f":"INDEX('Targets & historical'!F$3:F$41,MATCH(Charts!$AC4,'Targets & historical'!$A$3:$A$41,0))","v":15525.062701700001},{"$f":"INDEX('Targets & historical'!G$3:G$41,MATCH(Charts!$AC4,'Targets & historical'!$A$3:$A$41,0))","v":22166.708302139999},{"$f":"INDEX('Targets & historical'!H$3:H$41,MATCH(Charts!$AC4,'Targets & historical'!$A$3:$A$41,0))","v":13319.779221150002},{"$f":"INDEX('Targets & historical'!I$3:I$41,MATCH(Charts!$AC4,'Targets & historical'!$A$3:$A$41,0))","v":15854.543946649999},{"$f":"INDEX('Targets & historical'!J$3:J$41,MATCH(Charts!$AC4,'Targets & historical'!$A$3:$A$41,0))","v":11317.191828309999},{"$f":"INDEX('Targets & historical'!K$3:K$41,MATCH(Charts!$AC4,'Targets & historical'!$A$3:$A$41,0))","v":15137.349039960001},{"$f":"INDEX('Targets & historical'!L$3:L$41,MATCH(Charts!$AC4,'Targets & historical'!$A$3:$A$41,0))","v":19806.26173762},{"$f":"INDEX('Targets & historical'!M$3:M$41,MATCH(Charts!$AC4,'Targets & historical'!$A$3:$A$41,0))","v":15073.943551040002},{"$f":"INDEX('Targets & historical'!N$3:N$41,MATCH(Charts!$AC4,'Targets & historical'!$A$3:$A$41,0))","v":36991.064435239998}]
["Figure 4:","Non-tax Revenues","Figure 4: Non-tax Revenues","Date:",{"$f":"B12","v":"2020-05-23"},null,null,null,null,null,null,null,null,null,null,null,"Source:","RMIS",null,null,null,null,null,null,null,null,null,null,null,"Cummulative"]
[null,null,{"$f":"#REF!&\" \"&#REF!","v":{"$error":"#REF!"}},null,null,null,null,null,null,null,null,null,null,null,null,null,null,null,null,null,null,null,null,null,null,null,null,null,null,{"$f":"AD2","v":"Actual"},13060.289909859999,{"$f":"SUM($AE2:AF2)","v":23694.573799769998},{"$f":"SUM($AE2:AG2)","v":37555.872991969998},{"$f":"SUM($AE2:AH2)","v":39063.663334069999},{"$f":"SUM($AE2:AI2)","v":{"$error":"#N/A"}},{"$f":"SUM($AE2:AJ2)","v":{"$error":"#N/A"}},{"$f":"SUM($AE2:AK2)","v":{"$error":"#N/A"}},{"$f":"SUM($AE2:AL2)","v":{"$error":"#N/A"}},{"$f":"SUM($AE2:AM2)","v":{"$error":"#N/A"}},{"$f":"SUM($AE2:AN2)","v":{"$error":"#N/A"}},{"$f":"SUM($AE2:AO2)","v":{"$error":"#N/A"}},{"$f":"SUM($AE2:AP2)","v":{"$error":"#N/A"}},"Flag if any",{"$f":"IF((1-AE6/AE7)>$B$11,AE6,#N/A)","v":{"$error":"#N/A"}},{"$error":"#N/A"},{"$error":"#N/A"},39063.663334069999,{"$error":"#N/A"},{"$error":"#N/A"},{"$error":"#N/A"},{"$error":"#N/A"},{"$error":"#N/A"},{"$error":"#N/A"},{"$error":"#N/A"},{"$error":"#N/A"}]
[null,null,{"$f":"A5&\" \"&B5","v":"Figure 4: Non-tax Revenues"},null,null,null,null,null,null,null,null,null,null,null,null,null,null,null,null,null,null,null,null,null,null,null,null,null,null,"FY1399 Targets",12979.40000020148,{"$f":"SUM($AE3:AF3)","v":25958.80000040296},{"$f":"SUM($AE3:AG3)","v":38938.20000060444},{"$f":"SUM($AE3:AH3)","v":53458.533334163178},{"$f":"SUM($AE3:AI3)","v":67978.866667721915},{"$f":"SUM($AE3:AJ3)","v":82499.200001280653},{"$f":"SUM($AE3:AK3)","v":97671.466668182838},{"$f":"SUM($AE3:AL3)","v":112843.73333508502},{"$f":"SUM($AE3:AM3)","v":128016.00000198721},{"$f":"SUM($AE3:AN3)","v":144610.66666891146},{"$f":"SUM($AE3:AO3)","v":161205.33333583572},{"$f":"SUM($AE3:AP3)","v":177800.00000275997},"Historical Year Performance",{"$f":"INDEX('Targets & historical'!Q$49:Q$88,MATCH(Charts!$AQ8,'Targets & historical'!$A$49:$A$88,0))","v":13348.76693858},{"$f":"INDEX('Targets & historical'!R$49:R$88,MATCH(Charts!$AQ8,'Targets & historical'!$A$49:$A$88,0))","v":24348.010168879999},{"$f":"INDEX('Targets & historical'!S$49:S$88,MATCH(Charts!$AQ8,'Targets & historical'!$A$49:$A$88,0))","v":37998.603911130005},{"$f":"INDEX('Targets & historical'!T$49:T$88,MATCH(Charts!$AQ8,'Targets & historical'!$A$49:$A$88,0))","v":52685.273273490006},{"$f":"INDEX('Targets & historical'!U$49:U$88,MATCH(Charts!$AQ8,'Targets & historical'!$A$49:$A$88,0))","v":65492.44001214001},{"$f":"INDEX('Targets & historical'!V$49:V$88,MATCH(Charts!$AQ8,'Targets & historical'!$A$49:$A$88,0))","v":80274.610771290012},{"$f":"INDEX('Targets & historical'!W$49:W$88,MATCH(Charts!$AQ8,'Targets & historical'!$A$49:$A$88,0))","v":95942.995816700015},{"$f":"INDEX('Targets & historical'!X$49:X$88,MATCH(Charts!$AQ8,'Targets & historical'!$A$49:$A$88,0))","v":108982.17753231002},{"$f":"INDEX('Targets & historical'!Y$49:Y$88,MATCH(Charts!$AQ8,'Targets & historical'!$A$49:$A$88,0))","v":126400.31833971001},{"$f":"INDEX('Targets & historical'!Z$49:Z$88,MATCH(Charts!$AQ8,'Targets & historical'!$A$49:$A$88,0))","v":143027.49884804001},{"$f":"INDEX('Targets & historical'!AA$49:AA$88,MATCH(Charts!$AQ8,'Targets & historical'!$A$49:$A$88,0))","v":166502.07823727001},{"$f":"INDEX('Targets & historical'!AB$49:AB$88,MATCH(Charts!$AQ8,'Targets & historical'!$A$49:$A$88,0))","v":189561.77369972999}]
[null,null,{"$f":"#REF!&\" \"&#REF!","v":{"$error":"#REF!"}},null,null,null,null,null,null,null,null,null,null,null,null,null,null,null,null,null,null,null,null,null,null,null,null,null,null,"FY1398",14436.95750846,{"$f":"SUM($AE4:AF4)","v":27941.937530000003},{"$f":"SUM($AE4:AG4)","v":42167.452329649997},{"$f":"SUM($AE4:AH4)","v":57692.515031349998},{"$f":"SUM($AE4:AI4)","v":79859.223333489994},{"$f":"SUM($AE4:AJ4)","v":93179.002554639999},{"$f":"SUM($AE4:AK4)","v":109033.54650128999},{"$f":"SUM($AE4:AL4)","v":120350.73832959999},{"$f":"SUM($AE4:AM4)","v":135488.08736956},{"$f":"SUM($AE4:AN4)","v":155294.34910717999},{"$f":"SUM($AE4:AO4)","v":170368.29265821999},{"$f":"SUM($AE4:AP4)","v":207359.35709345998},{"$f":"$B$10&$B$2","v":"FY1397Total Revenues"}]
[null,null,null,null,null,null,null,null,null,null,null,null,null,null,null,null,null,null,null,null,null,null,null,null,null,null,null,null,{"$f":"#REF!","v":{"$error":"#REF!"}},{"$f":"FY1400_YTD_Actual!$A$1","v":"Actual"},{"$f":"IF(INDEX(FY1400_YTD_Actual!B$3:B$20,MATCH($B$3,FY1400_YTD_Actual!$A$3:$A$20,0))=0,#N/A,INDEX(FY1400_YTD_Actual!B$3:B$20,MATCH($B$3,FY1400_YTD_Actual!$A$3:$A$20,0)))","v":7284.6567496408297},{"$f":"IF(INDEX(FY1400_YTD_Actual!C$3:C$20,MATCH($B$2,FY1400_YTD_Actual!$A$3:$A$20,0))=0,#N/A,INDEX(FY1400_YTD_Actual!C$3:C$20,MATCH($B$2,FY1400_YTD_Actual!$A$3:$A$20,0)))","v":10634.283889910001},{"$f":"IF(INDEX(FY1400_YTD_Actual!D$3:D$20,MATCH($B$2,FY1400_YTD_Actual!$A$3:$A$20,0))=0,#N/A,INDEX(FY1400_YTD_Actual!D$3:D$20,MATCH($B$2,FY1400_YTD_Actual!$A$3:$A$20,0)))","v":13861.2991922},{"$f":"IF(INDEX(FY1400_YTD_Actual!E$3:E$20,MATCH($B$2,FY1400_YTD_Actual!$A$3:$A$20,0))=0,#N/A,INDEX(FY1400_YTD_Actual!E$3:E$20,MATCH($B$2,FY1400_YTD_Actual!$A$3:$A$20,0)))","v":1507.7903421000001},{"$f":"IF(INDEX(FY1400_YTD_Actual!F$3:F$20,MATCH($B$2,FY1400_YTD_Actual!$A$3:$A$20,0))=0,#N/A,INDEX(FY1400_YTD_Actual!F$3:F$20,MATCH($B$2,FY1400_YTD_Actual!$A$3:$A$20,0)))","v":{"$error":"#N/A"}},{"$f":"IF(INDEX(FY1400_YTD_Actual!G$3:G$20,MATCH($B$2,FY1400_YTD_Actual!$A$3:$A$20,0))=0,#N/A,INDEX(FY1400_YTD_Actual!G$3:G$20,MATCH($B$2,FY1400_YTD_Actual!$A$3:$A$20,0)))","v":{"$error":"#N/A"}},{"$f":"IF(INDEX(FY1400_YTD_Actual!H$3:H$20,MATCH($B$2,FY1400_YTD_Actual!$A$3:$A$20,0))=0,#N/A,INDEX(FY1400_YTD_Actual!H$3:H$20,MATCH($B$2,FY1400_YTD_Actual!$A$3:$A$20,0)))","v":{"$error":"#N/A"}},{"$f":"IF(INDEX(FY1400_YTD_Actual!I$3:I$20,MATCH($B$2,FY1400_YTD_Actual!$A$3:$A$20,0))=0,#N/A,INDEX(FY1400_YTD_Actual!I$3:I$20,MATCH($B$2,FY1400_YTD_Actual!$A$3:$A$20,0)))","v":{"$error":"#N/A"}},{"$f":"IF(INDEX(FY1400_YTD_Actual!J$3:J$20,MATCH($B$2,FY1400_YTD_Actual!$A$3:$A$20,0))=0,#N/A,INDEX(FY1400_YTD_Actual!J$3:J$20,MATCH($B$2,FY1400_YTD_Actual!$A$3:$A$20,0)))","v":{"$error":"#N/A"}},{"$f":"IF(INDEX(FY1400_YTD_Actual!K$3:K$20,MATCH($B$2,FY1400_YTD_Actual!$A$3:$A$20,0))=0,#N/A,INDEX(FY1400_YTD_Actual!K$3:K$20,MATCH($B$2,FY1400_YTD_Actual!$A$3:$A$20,0)))","v":{"$error":"#N/A"}},{"$f":"IF(INDEX(FY1400_YTD_Actual!L$3:L$20,MATCH($B$2,FY1400_YTD_Actual!$A$3:$A$20,0))=0,#N/A,INDEX(FY1400_YTD_Actual!L$3:L$20,MATCH($B$2,FY1400_YTD_Actual!$A$3:$A$20,0)))","v":{"$error":"#N/A"}},{"$f":"IF(INDEX(FY1400_YTD_Actual!M$3:M$20,MATCH($B$2,FY1400_YTD_Actual!$A$3:$A$20,0))=0,#N/A,INDEX(FY1400_YTD_Actual!M$3:M$20,MATCH($B$2,FY1400_YTD_Actual!$A$3:$A$20,0)))","v":{"$error":"#N/A"}},{"$f":"IFERROR(IF(AR9=\"#N/A\",\"\",\"AFMIS\"),\"\")","v":"AFMIS"},{"$f":"INDEX(FY1400_YTD_Actual!P26,MATCH(Charts!$B$2,FY1400_YTD_Actual!$A$26,0))","v":12986.517196809998},{"$f":"INDEX(FY1400_YTD_Actual!Q26,MATCH(Charts!$B$2,FY1400_YTD_Actual!$A$26,0))","v":23725.880700719998},{"$f":"INDEX(FY1400_YTD_Actual!R26,MATCH(Charts!$B$2,FY1400_YTD_Actual!$A$26,0))","v":38116.829468309996},{"$f":"INDEX(FY1400_YTD_Actual!S26,MATCH(Charts!$B$2,FY1400_YTD_Actual!$A$26,0))","v":39753.194655309999},{"$f":"INDEX(FY1400_YTD_Actual!T26,MATCH(Charts!$B$2,FY1400_YTD_Actual!$A$26,0))","v":{"$error":"#N/A"}},{"$f":"INDEX(FY1400_YTD_Actual!U26,MATCH(Charts!$B$2,FY1400_YTD_Actual!$A$26,0))","v":{"$error":"#N/A"}},{"$f":"INDEX(FY1400_YTD_Actual!V26,MATCH(Charts!$B$2,FY1400_YTD_Actual!$A$26,0))","v":{"$error":"#N/A"}},{"$f":"INDEX(FY1400_YTD_Actual!W26,MATCH(Charts!$B$2,FY1400_YTD_Actual!$A$26,0))","v":{"$error":"#N/A"}},{"$f":"INDEX(FY1400_YTD_Actual!X26,MATCH(Charts!$B$2,FY1400_YTD_Actual!$A$26,0))","v":{"$error":"#N/A"}},{"$f":"INDEX(FY1400_YTD_Actual!Y26,MATCH(Charts!$B$2,FY1400_YTD_Actual!$A$26,0))","v":{"$error":"#N/A"}},{"$f":"INDEX(FY1400_YTD_Actual!Z26,MATCH(Charts!$B$2,FY1400_YTD_Actual!$A$26,0))","v":{"$error":"#N/A"}},{"$f":"INDEX(FY1400_YTD_Actual!AA26,MATCH(Charts!$B$2,FY1400_YTD_Actual!$A$26,0))","v":{"$error":"#N/A"}}]
["Historical Year Comparison","FY1397",null,null,null,null,null,null,null,null,null,null,null,null,null,null,null,null,null,null,null,null,null,null,null,null,null,null,{"$f":"AD10&#REF!","v":{"$error":"#REF!"}},{"$f":"'Targets & historical'!$C$94","v":"FY1399 Targets"},{"$f":"INDEX('Targets & historical'!C$3:C$41,MATCH(Charts!$AC10,'Targets & historical'!$A$3:$A$41,0))","v":{"$error":"#REF!"}},{"$f":"INDEX('Targets & historical'!D$3:D$41,MATCH(Charts!$AC10,'Targets & historical'!$A$3:$A$41,0))","v":{"$error":"#REF!"}},{"$f":"INDEX('Targets & historical'!E$3:E$41,MATCH(Charts!$AC10,'Targets & historical'!$A$3:$A$41,0))","v":{"$error":"#REF!"}},{"$f":"INDEX('Targets & historical'!F$3:F$41,MATCH(Charts!$AC10,'Targets & historical'!$A$3:$A$41,0))","v":{"$error":"#REF!"}},{"$f":"INDEX('Targets & historical'!G$3:G$41,MATCH(Charts!$AC10,'Targets & historical'!$A$3:$A$41,0))","v":{"$error":"#REF!"}},{"$f":"INDEX('Targets & historical'!H$3:H$41,MATCH(Charts!$AC10,'Targets & historical'!$A$3:$A$41,0))","v":{"$error":"#REF!"}},{"$f":"INDEX('Targets & historical'!I$3:I$41,MATCH(Charts!$AC10,'Targets & historical'!$A$3:$A$41,0))","v":{"$error":"#REF!"}},{"$f":"INDEX('Targets & historical'!J$3:J$41,MATCH(Charts!$AC10,'Targets & historical'!$A$3:$A$41,0))","v":{"$error":"#REF!"}},{"$f":"INDEX('Targets & historical'!K$3:K$41,MATCH(Charts!$AC10,'Targets & historical'!$A$3:$A$41,0))","v":{"$error":"#REF!"}},{"$f":"INDEX('Targets & historical'!L$3:L$41,MATCH(Charts!$AC10,'Targets & historical'!$A$3:$A$41,0))","v":{"$error":"#REF!"}},{"$f":"INDEX('Targets & historical'!M$3:M$41,MATCH(Charts!$AC10,'Targets & historical'!$A$3:$A$41,0))","v":{"$error":"#REF!"}},{"$f":"INDEX('Targets & historical'!N$3:N$41,MATCH(Charts!$AC10,'Targets & historical'!$A$3:$A$41,0))","v":{"$error":"#REF!"}}]
{"$rows_left_out":104}
{"sheet":"Targets & historical","index":3,"n_rows":114,"n_cols":28,"rows_kept":114,"cut":false,"hidden":false,"merged":[[93,0,106,0],[107,0,109,0],[22,2,22,13],[0,2,0,13]]}
[null,null,"FY1399 - Target",null,null,null,null,null,null,null,null,null,null,null,null,null,null,22,23,25,30]
[null,{"$f":"C94","v":"FY1399 Targets"},"M1","M2","M3","M4","M5","M6","M7","M8","M9","M10","M11","M12","Total",null,null,"Q1","Q2","Q3","Q4","Budget Target"]
[{"$f":"$B$2&B3","v":"FY1399 TargetsCustoms Department"},{"$f":"B94","v":"Customs Department"},{"$f":"SUM(C4:C9)","v":5969.21},{"$f":"SUM(D4:D9)","v":5969.21},5969.21,{"$f":"SUM(F4:F9)","v":6677.8833333333332},6677.8833333333332,6677.8833333333332,6977.7066666666669,6977.7066666666669,6977.7066666666669,7631.8666666666677,7631.8666666666677,7631.8666666666677,{"$f":"SUM(C3:N3)","v":81770},null,null,{"$f":"$V3*R$1/100","v":19937.825819999998},{"$f":"$V3*S$1/100","v":20844.090630000002},22656.62025,27187.944300000003,90626.481]
[{"$f":"$B$2&B4","v":"FY1399 TargetsHerat Customs Office"},{"$f":"B95","v":"Herat Customs Office"},1327.8597860987384,1327.8597860987384,1327.8597860987384,1485.5052401561227,1485.5052401561227,1485.5052401561227,1552.2013937957854,1552.2013937957854,1552.2013937957854,1697.7202744641406,1697.7202744641406,1697.7202744641406,18189.860083544361,null,null,{"$f":"$V4*R$1/100","v":4552.9158400000006},4759.8665600000004,5173.768,6208.5216,20695.072]
["FY1399 TargetsNangarhar Customs Office","Nangarhar Customs Office",1082.8716612395006,1082.8716612395006,1082.8716612395006,1211.4317671400806,1211.4317671400806,1211.4317671400806,1265.8225811749414,1265.8225811749414,1265.8225811749414,1384.4934481600922,1384.4934481600922,1384.4934481600922,14833.858373143845,null,null,4402.1344399999998,4602.23146,5002.4255000000003,6002.9106000000002,20009.702000000001]
["FY1399 TargetsBalkh Customs Office","Balkh Customs Office",1334.6926511980473,1334.6926511980473,1334.6926511980473,1493.1493129841167,1493.1493129841167,1493.1493129841167,1560.1886698936078,1560.1886698936078,1560.1886698936078,1706.4563576961336,1706.4563576961336,1706.4563576961336,18283.460975315713,null,null,2608.2625829982699,2726.8199731345549,2963.9347534071248,3556.7217040885498,11855.739013628499]
["FY1399 TargetsKandahar Customs Office","Kandahar Customs Office",621.09775569123201,621.09775569123201,621.09775569123201,694.83538878699471,694.83538878699471,694.83538878699471,726.03207971212498,726.03207971212498,726.03207971212498,794.09758718513683,794.09758718513683,794.09758718513683,8508.1884341264649,null,null,2868.4995281021202,2998.88587028858,3259.6585546615006,3911.5902655937998,13038.634218646001]
["FY1399 TargetsNimroz Customs Office","Nimroz Customs Office",562.91472788653834,562.91472788653834,562.91472788653834,629.74478690503145,629.74478690503145,629.74478690503145,658.01904264362474,658.01904264362474,658.01904264362474,719.70832789146471,719.70832789146471,719.70832789146471,7711.1606559799784,null,null,1870.6679200000001,1955.6982800000001,2125.759,2550.9108000000001,8503.0360000000001]
["FY1399 TargetsOther Customs Offices","Other Customs Offices",1039.7734178859439,1039.7734178859439,1039.7734178859439,1163.2168373609875,1163.2168373609875,1163.2168373609875,1215.4428994465827,1215.4428994465827,1215.4428994465827,1329.3906712697001,1329.3906712697001,1329.3906712697001,14243.471477889645,null,null,3635.3455088996125,3800.5884865768671,4131.0744419313778,4957.2893303176534,{"$f":"V3-SUM(V4:V8)","v":16524.297767725511}]
["FY1399 TargetsAfghanistan Revenue Department","Afghanistan Revenue Department",{"$f":"SUM(C11:C15)","v":7010.1900002014791},{"$f":"SUM(D11:D15)","v":7010.1900002014791},7010.1900002014791,7842.4500002253999,7842.4500002253999,7842.4500002253999,8194.5600002355204,8194.5600002355204,8194.5600002355204,8962.8000002575991,8962.8000002575991,8962.8000002575991,96030.000002759989]
{"$rows_left_out":104}