{"text_format":"1","workbook":"xlsx","n_sheets":4,"sheets":["Instructions","FY1399_YTD_Actual","Charts","Targets"],"not_rendered":{"charts":12,"images":0,"macros":1,"external_links":0,"defined_names":0,"comments":0,"pivot_tables":0},"unopened":[],"bounds":{"document_bytes":16777216,"sheet_cells":100000,"rows_first":2000,"rows_last":500,"rows_between":2000,"halvings":0,"cell_chars":16384,"cell_head_chars":4096},"cells_cut":0,"cells_raw":0,"read":"whole","date_system":"1900"}

{"sheet":"Instructions","index":0,"n_rows":15,"n_cols":4,"rows_kept":15,"cut":false,"hidden":false,"merged":[]}
[]
[]
[]
[]
[]
[null,null,null,"Instructions:"]
[]
[null,null,null,"1. Insert YTD actual data in yellow shaded area of YTD_Actual_Data sheet for each tax type and tax collectorate"]
[null,null,null,"2. Select charts for Page 1 using cell B2 to B5 and for Page 2 using cell B78 to B85 in Charts sheet"]
[null,null,null,"3. Pick a historical year other than previous year using cell B10 to compare against"]
{"$rows_left_out":6}
{"sheet":"FY1399_YTD_Actual","index":1,"n_rows":28,"n_cols":27,"rows_kept":28,"cut":false,"hidden":false,"merged":[[27,1,31,13],[27,0,31,0],[0,1,1,1],[0,2,1,2],[0,3,1,3],[0,4,1,4],[0,5,1,5],[0,6,1,6],[0,7,1,7],[0,8,1,8],[0,9,1,9],[0,10,1,10],[0,11,1,11],[0,12,1,12],[0,13,1,13],[0,0,1,0]]}
[{"$f":"Targets!C118","v":"Actual"},"M1","M2","M3","M4","M5","M6","M7","M8","M9","M10","M11","M12","Total"]
[]
[{"$f":"Targets!B3","v":"Customs Department"},{"$f":"SUM(B4:B9)","v":5551.3169330000001},{"$f":"SUM(C4:C9)","v":6482.7989980000002},{"$f":"SUM(D4:D9)","v":5425.0733120000004},{"$f":"SUM(E4:E9)","v":2776.8527540000005},{"$f":"SUM(F4:F9)","v":1130.495807},{"$f":"SUM(G4:G9)","v":0},{"$f":"SUM(H4:H9)","v":0},{"$f":"SUM(I4:I9)","v":0},{"$f":"SUM(J4:J9)","v":0},{"$f":"SUM(K4:K9)","v":0},{"$f":"SUM(L4:L9)","v":0},{"$f":"SUM(M4:M9)","v":0},{"$f":"SUM(N4:N9)","v":21366.537804000003}]
[{"$f":"Targets!B4","v":"Herat Customs Office"},1014.264063,1248.3467909999999,1262.1622299999999,614.61909400000002,239.72846200000001,0,null,null,null,null,null,null,{"$f":"SUM(B4:M4)","v":4379.1206400000001}]
[{"$f":"Targets!B5","v":"Nangarhar Customs Office"},1099.8983800000001,1745.768924,1251.9192,80.464445999999995,69.360511000000002,null,null,null,null,null,null,null,4247.4114609999997]
[{"$f":"Targets!B6","v":"Balkh Customs Office"},1121.2171109999999,857.82738800000004,875.70486300000005,1051.2300110000001,358.33839599999999,null,null,null,null,null,null,null,4264.3177690000002]
[{"$f":"Targets!B7","v":"Kandahar Customs Office"},802.16770599999995,1045.150478,549.89336300000002,109.538639,121.95689,null,null,null,null,null,null,null,2628.7070759999997]
[{"$f":"Targets!B8","v":"Nimroz Customs Office"},479.916473,502.50249400000001,426.87608599999999,301.63225899999998,149.98532499999999,null,null,null,null,null,null,null,1860.9126369999999]
[{"$f":"Targets!B9","v":"Other Customs Offices"},1033.8532,1083.2029230000001,1058.51757,619.36830499999996,191.12622300000001,null,null,null,null,null,null,null,3986.0682210000004]
[{"$f":"Targets!B10","v":"Afghanistan Revenue Department"},{"$f":"SUM(B11:B15)","v":6257.3296975999992},{"$f":"SUM(C11:C15)","v":6177.4128711499998},7512.8515767099998,3698.2683926,269.28551760000005,0,0,0,0,0,0,0,23915.14805566]
{"$rows_left_out":19}
{"sheet":"Charts","index":2,"n_rows":113,"n_cols":55,"rows_kept":113,"cut":false,"hidden":false,"merged":[[76,0,76,1],[0,3,2,18],[73,3,76,18],[0,0,0,1],[3,3,3,18],[4,17,4,18]]}
["Select charts for page 1:",null,null,"Ministry of Finance",null,null,null,null,null,null,null,null,null,null,null,null,null,null,null,null,null,null,null,null,null,null,null,null,null,null,"M1","M2","M3","M4","M5","M6","M7","M8","M9","M10","M11","M12"]
["Figure 1:","Total Revenues",{"$f":"A2&\" \"&B2","v":"Figure 1: Total Revenues"},null,null,null,null,null,null,null,null,null,null,null,null,null,null,null,null,null,null,null,null,null,null,null,null,null,{"$f":"A2","v":"Figure 1:"},{"$f":"FY1399_YTD_Actual!$A$1","v":"Actual"},{"$f":"IF(INDEX(FY1399_YTD_Actual!B$3:B$19,MATCH($B$2,FY1399_YTD_Actual!$A$3:$A$19,0))=0,#N/A,INDEX(FY1399_YTD_Actual!B$3:B$19,MATCH($B$2,FY1399_YTD_Actual!$A$3:$A$19,0)))","v":11808.6466306},{"$f":"IF(INDEX(FY1399_YTD_Actual!C$3:C$19,MATCH($B$2,FY1399_YTD_Actual!$A$3:$A$19,0))=0,#N/A,INDEX(FY1399_YTD_Actual!C$3:C$19,MATCH($B$2,FY1399_YTD_Actual!$A$3:$A$19,0)))","v":12660.21186915},{"$f":"IF(INDEX(FY1399_YTD_Actual!D$3:D$19,MATCH($B$2,FY1399_YTD_Actual!$A$3:$A$19,0))=0,#N/A,INDEX(FY1399_YTD_Actual!D$3:D$19,MATCH($B$2,FY1399_YTD_Actual!$A$3:$A$19,0)))","v":12937.92488871},{"$f":"IF(INDEX(FY1399_YTD_Actual!E$3:E$19,MATCH($B$2,FY1399_YTD_Actual!$A$3:$A$19,0))=0,#N/A,INDEX(FY1399_YTD_Actual!E$3:E$19,MATCH($B$2,FY1399_YTD_Actual!$A$3:$A$19,0)))","v":6475.1211466000004},{"$f":"IF(INDEX(FY1399_YTD_Actual!F$3:F$19,MATCH($B$2,FY1399_YTD_Actual!$A$3:$A$19,0))=0,#N/A,INDEX(FY1399_YTD_Actual!F$3:F$19,MATCH($B$2,FY1399_YTD_Actual!$A$3:$A$19,0)))","v":1399.7813246000001},{"$f":"IF(INDEX(FY1399_YTD_Actual!G$3:G$19,MATCH($B$2,FY1399_YTD_Actual!$A$3:$A$19,0))=0,#N/A,INDEX(FY1399_YTD_Actual!G$3:G$19,MATCH($B$2,FY1399_YTD_Actual!$A$3:$A$19,0)))","v":{"$error":"#N/A"}},{"$f":"IF(INDEX(FY1399_YTD_Actual!H$3:H$19,MATCH($B$2,FY1399_YTD_Actual!$A$3:$A$19,0))=0,#N/A,INDEX(FY1399_YTD_Actual!H$3:H$19,MATCH($B$2,FY1399_YTD_Actual!$A$3:$A$19,0)))","v":{"$error":"#N/A"}},{"$f":"IF(INDEX(FY1399_YTD_Actual!I$3:I$19,MATCH($B$2,FY1399_YTD_Actual!$A$3:$A$19,0))=0,#N/A,INDEX(FY1399_YTD_Actual!I$3:I$19,MATCH($B$2,FY1399_YTD_Actual!$A$3:$A$19,0)))","v":{"$error":"#N/A"}},{"$f":"IF(INDEX(FY1399_YTD_Actual!J$3:J$19,MATCH($B$2,FY1399_YTD_Actual!$A$3:$A$19,0))=0,#N/A,INDEX(FY1399_YTD_Actual!J$3:J$19,MATCH($B$2,FY1399_YTD_Actual!$A$3:$A$19,0)))","v":{"$error":"#N/A"}},{"$f":"IF(INDEX(FY1399_YTD_Actual!K$3:K$19,MATCH($B$2,FY1399_YTD_Actual!$A$3:$A$19,0))=0,#N/A,INDEX(FY1399_YTD_Actual!K$3:K$19,MATCH($B$2,FY1399_YTD_Actual!$A$3:$A$19,0)))","v":{"$error":"#N/A"}},{"$f":"IF(INDEX(FY1399_YTD_Actual!L$3:L$19,MATCH($B$2,FY1399_YTD_Actual!$A$3:$A$19,0))=0,#N/A,INDEX(FY1399_YTD_Actual!L$3:L$19,MATCH($B$2,FY1399_YTD_Actual!$A$3:$A$19,0)))","v":{"$error":"#N/A"}},{"$f":"IF(INDEX(FY1399_YTD_Actual!M$3:M$19,MATCH($B$2,FY1399_YTD_Actual!$A$3:$A$19,0))=0,#N/A,INDEX(FY1399_YTD_Actual!M$3:M$19,MATCH($B$2,FY1399_YTD_Actual!$A$3:$A$19,0)))","v":{"$error":"#N/A"}}]
["Figure 2:","Tax Revenues",{"$f":"A3&\" \"&B3","v":"Figure 2: Tax Revenues"},null,null,null,null,null,null,null,null,null,null,null,null,null,null,null,null,null,null,null,null,null,null,null,null,null,{"$f":"AD3&$B$2","v":"2019 TargetTotal Revenues"},{"$f":"Targets!$C$115","v":"2019 Target"},{"$f":"INDEX(Targets!C$3:C$41,MATCH(Charts!$AC3,Targets!$A$3:$A$41,0))","v":{"$error":"#N/A"}},{"$f":"INDEX(Targets!D$3:D$41,MATCH(Charts!$AC3,Targets!$A$3:$A$41,0))","v":{"$error":"#N/A"}},{"$f":"INDEX(Targets!E$3:E$41,MATCH(Charts!$AC3,Targets!$A$3:$A$41,0))","v":{"$error":"#N/A"}},{"$f":"INDEX(Targets!F$3:F$41,MATCH(Charts!$AC3,Targets!$A$3:$A$41,0))","v":{"$error":"#N/A"}},{"$f":"INDEX(Targets!G$3:G$41,MATCH(Charts!$AC3,Targets!$A$3:$A$41,0))","v":{"$error":"#N/A"}},{"$f":"INDEX(Targets!H$3:H$41,MATCH(Charts!$AC3,Targets!$A$3:$A$41,0))","v":{"$error":"#N/A"}},{"$f":"INDEX(Targets!I$3:I$41,MATCH(Charts!$AC3,Targets!$A$3:$A$41,0))","v":{"$error":"#N/A"}},{"$f":"INDEX(Targets!J$3:J$41,MATCH(Charts!$AC3,Targets!$A$3:$A$41,0))","v":{"$error":"#N/A"}},{"$f":"INDEX(Targets!K$3:K$41,MATCH(Charts!$AC3,Targets!$A$3:$A$41,0))","v":{"$error":"#N/A"}},{"$f":"INDEX(Targets!L$3:L$41,MATCH(Charts!$AC3,Targets!$A$3:$A$41,0))","v":{"$error":"#N/A"}},{"$f":"INDEX(Targets!M$3:M$41,MATCH(Charts!$AC3,Targets!$A$3:$A$41,0))","v":{"$error":"#N/A"}},{"$f":"INDEX(Targets!N$3:N$41,MATCH(Charts!$AC3,Targets!$A$3:$A$41,0))","v":{"$error":"#N/A"}}]
["Figure 3:","Customs Revenues","Figure 3: Customs Revenues","YTD Revenue",null,null,null,null,null,null,null,null,null,null,null,null,null,null,null,null,null,null,null,null,null,null,null,1397,{"$f":"AD4&$B$2","v":"Previous Year performanceTotal Revenues"},{"$f":"Targets!$C$116","v":"Previous Year performance"},{"$f":"INDEX(Targets!C$3:C$41,MATCH(Charts!$AC4,Targets!$A$3:$A$41,0))","v":14436.95750846},{"$f":"INDEX(Targets!D$3:D$41,MATCH(Charts!$AC4,Targets!$A$3:$A$41,0))","v":13504.980021540001},{"$f":"INDEX(Targets!E$3:E$41,MATCH(Charts!$AC4,Targets!$A$3:$A$41,0))","v":14225.514799649998},{"$f":"INDEX(Targets!F$3:F$41,MATCH(Charts!$AC4,Targets!$A$3:$A$41,0))","v":15525.062701700001},{"$f":"INDEX(Targets!G$3:G$41,MATCH(Charts!$AC4,Targets!$A$3:$A$41,0))","v":22166.708302139999},{"$f":"INDEX(Targets!H$3:H$41,MATCH(Charts!$AC4,Targets!$A$3:$A$41,0))","v":13319.779221150002},{"$f":"INDEX(Targets!I$3:I$41,MATCH(Charts!$AC4,Targets!$A$3:$A$41,0))","v":15854.543946649999},{"$f":"INDEX(Targets!J$3:J$41,MATCH(Charts!$AC4,Targets!$A$3:$A$41,0))","v":11317.191828309999},{"$f":"INDEX(Targets!K$3:K$41,MATCH(Charts!$AC4,Targets!$A$3:$A$41,0))","v":15137.349039960001},{"$f":"INDEX(Targets!L$3:L$41,MATCH(Charts!$AC4,Targets!$A$3:$A$41,0))","v":19806.26173762},{"$f":"INDEX(Targets!M$3:M$41,MATCH(Charts!$AC4,Targets!$A$3:$A$41,0))","v":15073.943551040002},{"$f":"INDEX(Targets!N$3:N$41,MATCH(Charts!$AC4,Targets!$A$3:$A$41,0))","v":36991.064435239998}]
["Figure 4:","Non-tax Revenues","Figure 4: Non-tax Revenues","Date:",{"$f":"B12","v":"2020-05-02"},null,null,null,null,null,null,null,null,null,null,null,"Source:","RMIS",null,null,null,null,null,null,null,null,null,null,null,"Cummulative"]
[null,null,{"$f":"#REF!&\" \"&#REF!","v":{"$error":"#REF!"}},null,null,null,null,null,null,null,null,null,null,null,null,null,null,null,null,null,null,null,null,null,null,null,null,null,null,{"$f":"AD2","v":"Actual"},11808.6466306,{"$f":"SUM($AE2:AF2)","v":24468.85849975},{"$f":"SUM($AE2:AG2)","v":37406.783388459997},{"$f":"SUM($AE2:AH2)","v":43881.904535059999},{"$f":"SUM($AE2:AI2)","v":45281.68585966},{"$f":"SUM($AE2:AJ2)","v":{"$error":"#N/A"}},{"$f":"SUM($AE2:AK2)","v":{"$error":"#N/A"}},{"$f":"SUM($AE2:AL2)","v":{"$error":"#N/A"}},{"$f":"SUM($AE2:AM2)","v":{"$error":"#N/A"}},{"$f":"SUM($AE2:AN2)","v":{"$error":"#N/A"}},{"$f":"SUM($AE2:AO2)","v":{"$error":"#N/A"}},{"$f":"SUM($AE2:AP2)","v":{"$error":"#N/A"}},"Flag if any",{"$f":"IF((1-AE6/AE7)>$B$11,AE6,#N/A)","v":{"$error":"#N/A"}},{"$error":"#N/A"},{"$error":"#N/A"},{"$error":"#N/A"},{"$error":"#N/A"},{"$error":"#N/A"},{"$error":"#N/A"},{"$error":"#N/A"},{"$error":"#N/A"},{"$error":"#N/A"},{"$error":"#N/A"},{"$error":"#N/A"}]
[null,null,{"$f":"A5&\" \"&B5","v":"Figure 4: Non-tax Revenues"},null,null,null,null,null,null,null,null,null,null,null,null,null,null,null,null,null,null,null,null,null,null,null,null,null,null,"2019 Target",{"$error":"#N/A"},{"$f":"SUM($AE3:AF3)","v":{"$error":"#N/A"}},{"$f":"SUM($AE3:AG3)","v":{"$error":"#N/A"}},{"$f":"SUM($AE3:AH3)","v":{"$error":"#N/A"}},{"$f":"SUM($AE3:AI3)","v":{"$error":"#N/A"}},{"$f":"SUM($AE3:AJ3)","v":{"$error":"#N/A"}},{"$f":"SUM($AE3:AK3)","v":{"$error":"#N/A"}},{"$f":"SUM($AE3:AL3)","v":{"$error":"#N/A"}},{"$f":"SUM($AE3:AM3)","v":{"$error":"#N/A"}},{"$f":"SUM($AE3:AN3)","v":{"$error":"#N/A"}},{"$f":"SUM($AE3:AO3)","v":{"$error":"#N/A"}},{"$f":"SUM($AE3:AP3)","v":{"$error":"#N/A"}},"Historical Year Performance",{"$f":"INDEX(Targets!Q$70:Q$109,MATCH(Charts!$AQ8,Targets!$A$70:$A$109,0))","v":10450},{"$f":"INDEX(Targets!R$70:R$109,MATCH(Charts!$AQ8,Targets!$A$70:$A$109,0))","v":20620},{"$f":"INDEX(Targets!S$70:S$109,MATCH(Charts!$AQ8,Targets!$A$70:$A$109,0))","v":32249},{"$f":"INDEX(Targets!T$70:T$109,MATCH(Charts!$AQ8,Targets!$A$70:$A$109,0))","v":45155},{"$f":"INDEX(Targets!U$70:U$109,MATCH(Charts!$AQ8,Targets!$A$70:$A$109,0))","v":56611},{"$f":"INDEX(Targets!V$70:V$109,MATCH(Charts!$AQ8,Targets!$A$70:$A$109,0))","v":80027},{"$f":"INDEX(Targets!W$70:W$109,MATCH(Charts!$AQ8,Targets!$A$70:$A$109,0))","v":91418},{"$f":"INDEX(Targets!X$70:X$109,MATCH(Charts!$AQ8,Targets!$A$70:$A$109,0))","v":104859},{"$f":"INDEX(Targets!Y$70:Y$109,MATCH(Charts!$AQ8,Targets!$A$70:$A$109,0))","v":114426},{"$f":"INDEX(Targets!Z$70:Z$109,MATCH(Charts!$AQ8,Targets!$A$70:$A$109,0))","v":125355},{"$f":"INDEX(Targets!AA$70:AA$109,MATCH(Charts!$AQ8,Targets!$A$70:$A$109,0))","v":139116},{"$f":"INDEX(Targets!AB$70:AB$109,MATCH(Charts!$AQ8,Targets!$A$70:$A$109,0))","v":153496}]
[null,null,{"$f":"#REF!&\" \"&#REF!","v":{"$error":"#REF!"}},null,null,null,null,null,null,null,null,null,null,null,null,null,null,null,null,null,null,null,null,null,null,null,null,null,null,"Previous Year performance",14436.95750846,{"$f":"SUM($AE4:AF4)","v":27941.937530000003},{"$f":"SUM($AE4:AG4)","v":42167.452329649997},{"$f":"SUM($AE4:AH4)","v":57692.515031349998},{"$f":"SUM($AE4:AI4)","v":79859.223333489994},{"$f":"SUM($AE4:AJ4)","v":93179.002554639999},{"$f":"SUM($AE4:AK4)","v":109033.54650128999},{"$f":"SUM($AE4:AL4)","v":120350.73832959999},{"$f":"SUM($AE4:AM4)","v":135488.08736956},{"$f":"SUM($AE4:AN4)","v":155294.34910717999},{"$f":"SUM($AE4:AO4)","v":170368.29265821999},{"$f":"SUM($AE4:AP4)","v":207359.35709345998},{"$f":"$B$10&$B$2","v":"FY1395Total Revenues"}]
[null,null,null,null,null,null,null,null,null,null,null,null,null,null,null,null,null,null,null,null,null,null,null,null,null,null,null,null,{"$f":"#REF!","v":{"$error":"#REF!"}},{"$f":"FY1399_YTD_Actual!$A$1","v":"Actual"},{"$f":"IF(INDEX(FY1399_YTD_Actual!B$3:B$19,MATCH($B$3,FY1399_YTD_Actual!$A$3:$A$19,0))=0,#N/A,INDEX(FY1399_YTD_Actual!B$3:B$19,MATCH($B$3,FY1399_YTD_Actual!$A$3:$A$19,0)))","v":6164.5322366},{"$f":"IF(INDEX(FY1399_YTD_Actual!C$3:C$19,MATCH($B$2,FY1399_YTD_Actual!$A$3:$A$19,0))=0,#N/A,INDEX(FY1399_YTD_Actual!C$3:C$19,MATCH($B$2,FY1399_YTD_Actual!$A$3:$A$19,0)))","v":12660.21186915},{"$f":"IF(INDEX(FY1399_YTD_Actual!D$3:D$19,MATCH($B$2,FY1399_YTD_Actual!$A$3:$A$19,0))=0,#N/A,INDEX(FY1399_YTD_Actual!D$3:D$19,MATCH($B$2,FY1399_YTD_Actual!$A$3:$A$19,0)))","v":12937.92488871},{"$f":"IF(INDEX(FY1399_YTD_Actual!E$3:E$19,MATCH($B$2,FY1399_YTD_Actual!$A$3:$A$19,0))=0,#N/A,INDEX(FY1399_YTD_Actual!E$3:E$19,MATCH($B$2,FY1399_YTD_Actual!$A$3:$A$19,0)))","v":6475.1211466000004},{"$f":"IF(INDEX(FY1399_YTD_Actual!F$3:F$19,MATCH($B$2,FY1399_YTD_Actual!$A$3:$A$19,0))=0,#N/A,INDEX(FY1399_YTD_Actual!F$3:F$19,MATCH($B$2,FY1399_YTD_Actual!$A$3:$A$19,0)))","v":1399.7813246000001},{"$f":"IF(INDEX(FY1399_YTD_Actual!G$3:G$19,MATCH($B$2,FY1399_YTD_Actual!$A$3:$A$19,0))=0,#N/A,INDEX(FY1399_YTD_Actual!G$3:G$19,MATCH($B$2,FY1399_YTD_Actual!$A$3:$A$19,0)))","v":{"$error":"#N/A"}},{"$f":"IF(INDEX(FY1399_YTD_Actual!H$3:H$19,MATCH($B$2,FY1399_YTD_Actual!$A$3:$A$19,0))=0,#N/A,INDEX(FY1399_YTD_Actual!H$3:H$19,MATCH($B$2,FY1399_YTD_Actual!$A$3:$A$19,0)))","v":{"$error":"#N/A"}},{"$f":"IF(INDEX(FY1399_YTD_Actual!I$3:I$19,MATCH($B$2,FY1399_YTD_Actual!$A$3:$A$19,0))=0,#N/A,INDEX(FY1399_YTD_Actual!I$3:I$19,MATCH($B$2,FY1399_YTD_Actual!$A$3:$A$19,0)))","v":{"$error":"#N/A"}},{"$f":"IF(INDEX(FY1399_YTD_Actual!J$3:J$19,MATCH($B$2,FY1399_YTD_Actual!$A$3:$A$19,0))=0,#N/A,INDEX(FY1399_YTD_Actual!J$3:J$19,MATCH($B$2,FY1399_YTD_Actual!$A$3:$A$19,0)))","v":{"$error":"#N/A"}},{"$f":"IF(INDEX(FY1399_YTD_Actual!K$3:K$19,MATCH($B$2,FY1399_YTD_Actual!$A$3:$A$19,0))=0,#N/A,INDEX(FY1399_YTD_Actual!K$3:K$19,MATCH($B$2,FY1399_YTD_Actual!$A$3:$A$19,0)))","v":{"$error":"#N/A"}},{"$f":"IF(INDEX(FY1399_YTD_Actual!L$3:L$19,MATCH($B$2,FY1399_YTD_Actual!$A$3:$A$19,0))=0,#N/A,INDEX(FY1399_YTD_Actual!L$3:L$19,MATCH($B$2,FY1399_YTD_Actual!$A$3:$A$19,0)))","v":{"$error":"#N/A"}},{"$f":"IF(INDEX(FY1399_YTD_Actual!M$3:M$19,MATCH($B$2,FY1399_YTD_Actual!$A$3:$A$19,0))=0,#N/A,INDEX(FY1399_YTD_Actual!M$3:M$19,MATCH($B$2,FY1399_YTD_Actual!$A$3:$A$19,0)))","v":{"$error":"#N/A"}},{"$f":"IFERROR(IF(AR9=\"#N/A\",\"\",\"AFMIS\"),\"\")","v":"AFMIS"},{"$f":"INDEX(FY1399_YTD_Actual!P25,MATCH(Charts!$B$2,FY1399_YTD_Actual!$A$25,0))","v":11770},{"$f":"INDEX(FY1399_YTD_Actual!Q25,MATCH(Charts!$B$2,FY1399_YTD_Actual!$A$25,0))","v":24580},{"$f":"INDEX(FY1399_YTD_Actual!R25,MATCH(Charts!$B$2,FY1399_YTD_Actual!$A$25,0))","v":38360},{"$f":"INDEX(FY1399_YTD_Actual!S25,MATCH(Charts!$B$2,FY1399_YTD_Actual!$A$25,0))","v":60580},{"$f":"INDEX(FY1399_YTD_Actual!T25,MATCH(Charts!$B$2,FY1399_YTD_Actual!$A$25,0))","v":62330},{"$f":"INDEX(FY1399_YTD_Actual!U25,MATCH(Charts!$B$2,FY1399_YTD_Actual!$A$25,0))","v":{"$error":"#N/A"}},{"$f":"INDEX(FY1399_YTD_Actual!V25,MATCH(Charts!$B$2,FY1399_YTD_Actual!$A$25,0))","v":{"$error":"#N/A"}},{"$f":"INDEX(FY1399_YTD_Actual!W25,MATCH(Charts!$B$2,FY1399_YTD_Actual!$A$25,0))","v":{"$error":"#N/A"}},{"$f":"INDEX(FY1399_YTD_Actual!X25,MATCH(Charts!$B$2,FY1399_YTD_Actual!$A$25,0))","v":{"$error":"#N/A"}},{"$f":"INDEX(FY1399_YTD_Actual!Y25,MATCH(Charts!$B$2,FY1399_YTD_Actual!$A$25,0))","v":{"$error":"#N/A"}},{"$f":"INDEX(FY1399_YTD_Actual!Z25,MATCH(Charts!$B$2,FY1399_YTD_Actual!$A$25,0))","v":{"$error":"#N/A"}},{"$f":"INDEX(FY1399_YTD_Actual!AA25,MATCH(Charts!$B$2,FY1399_YTD_Actual!$A$25,0))","v":{"$error":"#N/A"}}]
["Historical Year Comparison","FY1395",null,null,null,null,null,null,null,null,null,null,null,null,null,null,null,null,null,null,null,null,null,null,null,null,null,null,{"$f":"AD10&#REF!","v":{"$error":"#REF!"}},{"$f":"Targets!$C$115","v":"2019 Target"},{"$f":"INDEX(Targets!C$3:C$41,MATCH(Charts!$AC10,Targets!$A$3:$A$41,0))","v":{"$error":"#REF!"}},{"$f":"INDEX(Targets!D$3:D$41,MATCH(Charts!$AC10,Targets!$A$3:$A$41,0))","v":{"$error":"#REF!"}},{"$f":"INDEX(Targets!E$3:E$41,MATCH(Charts!$AC10,Targets!$A$3:$A$41,0))","v":{"$error":"#REF!"}},{"$f":"INDEX(Targets!F$3:F$41,MATCH(Charts!$AC10,Targets!$A$3:$A$41,0))","v":{"$error":"#REF!"}},{"$f":"INDEX(Targets!G$3:G$41,MATCH(Charts!$AC10,Targets!$A$3:$A$41,0))","v":{"$error":"#REF!"}},{"$f":"INDEX(Targets!H$3:H$41,MATCH(Charts!$AC10,Targets!$A$3:$A$41,0))","v":{"$error":"#REF!"}},{"$f":"INDEX(Targets!I$3:I$41,MATCH(Charts!$AC10,Targets!$A$3:$A$41,0))","v":{"$error":"#REF!"}},{"$f":"INDEX(Targets!J$3:J$41,MATCH(Charts!$AC10,Targets!$A$3:$A$41,0))","v":{"$error":"#REF!"}},{"$f":"INDEX(Targets!K$3:K$41,MATCH(Charts!$AC10,Targets!$A$3:$A$41,0))","v":{"$error":"#REF!"}},{"$f":"INDEX(Targets!L$3:L$41,MATCH(Charts!$AC10,Targets!$A$3:$A$41,0))","v":{"$error":"#REF!"}},{"$f":"INDEX(Targets!M$3:M$41,MATCH(Charts!$AC10,Targets!$A$3:$A$41,0))","v":{"$error":"#REF!"}},{"$f":"INDEX(Targets!N$3:N$41,MATCH(Charts!$AC10,Targets!$A$3:$A$41,0))","v":{"$error":"#REF!"}}]
{"$rows_left_out":104}
{"sheet":"Targets","index":3,"n_rows":135,"n_cols":28,"rows_kept":135,"cut":false,"hidden":false,"merged":[[114,0,127,0],[128,0,130,0],[22,2,22,13],[0,2,0,13],[45,2,45,13]]}
[null,null,{"$f":"B2","v":"2020 Target"},null,null,null,null,null,null,null,null,null,null,null,null,null,null,22,23,25,30]
[null,"2020 Target","M1","M2","M3","M4","M5","M6","M7","M8","M9","M10","M11","M12","Total",null,null,"Q1","Q2","Q3","Q4","Budget Target"]
[{"$f":"$B$2&B3","v":"2020 TargetCustoms Department"},{"$f":"B115","v":"Customs Department"},{"$f":"SUM(C4:C9)","v":6615.7331653592246},{"$f":"SUM(D4:D9)","v":6615.7331653592246},6615.7331653592246,7401.162673575388,7401.162673575388,7401.162673575388,7733.4597732053035,7733.4597732053035,7733.4597732053035,8458.4716269433011,8458.4716269433011,8458.4716269433011,{"$f":"SUM(C3:N3)","v":90626.48171724964},null,null,{"$f":"$V3*R$1/100","v":17690.798063774},{"$f":"$V3*S$1/100","v":18494.925248490999},20103.179617925001,24123.815541510001,80412.718471700005]
[{"$f":"$B$2&B4","v":"2020 TargetHerat Customs Office"},{"$f":"B116","v":"Herat Customs Office"},1510.7402777355471,1510.7402777355471,1510.7402777355471,1690.0975709826896,1690.0975709826896,1690.0975709826896,1765.9795027410962,1765.9795027410962,1765.9795027410962,1931.5400811230738,1931.5400811230738,1931.5400811230738,20695.072297747218,null,null,{"$f":"$V4*R$1/100","v":4801.0872867320004},5019.318527038,5455.78100765,6546.9372091799996,21823.1240306]
["2020 TargetNangarhar Customs Office","Nangarhar Customs Office",1460.7082902964733,1460.7082902964733,1460.7082902964733,1634.1257128887485,1634.1257128887485,1634.1257128887485,1707.4946224470189,1707.4946224470189,1707.4946224470189,1867.5722433014271,1867.5722433014271,1867.5722433014271,20009.702606801002,null,null,3815.5575257799997,3988.9919587700001,4335.8608247499997,5203.0329896999992,17343.443298999999]
["2020 TargetBalkh Customs Office","Balkh Customs Office",865.46894799488223,865.46894799488223,865.46894799488223,968.21868611299612,968.21868611299612,968.21868611299612,1011.6897291629675,1011.6897291629675,1011.6897291629675,1106.5356412719957,1106.5356412719957,1106.5356412719957,11855.739013628525,null,null,2769.8286474759998,2895.7299496340001,3147.53255395,3777.03906474,12590.1302158]
["2020 TargetKandahar Customs Office","Kandahar Customs Office",951.82029796115728,951.82029796115728,951.82029796115728,1064.8217945227557,1064.8217945227557,1064.8217945227557,1112.6301199911245,1112.6301199911245,1112.6301199911245,1216.9391937402925,1216.9391937402925,1216.9391937402925,13038.634218645991,null,null,1638.903002968,1713.3985940119999,1862.3897761000001,2234.8677313200001,7449.5591044000003]
["2020 TargetNimroz Customs Office","Nimroz Customs Office",620.72164093542574,620.72164093542574,620.72164093542574,694.41462113780506,694.41462113780506,694.41462113780506,725.59242045419637,725.59242045419637,725.59242045419637,793.61670987177718,793.61670987177718,793.61670987177718,8503.0361771976131,null,null,1590.5348673059998,1662.8319067290001,1807.4259855749999,2168.9111826899998,7229.7039422999997]
["2020 TargetOther Customs Offices","Other Customs Offices",1206.2737104357391,1206.2737104357391,1206.2737104357391,1349.4842879303931,1349.4842879303931,1349.4842879303931,1410.0733784089005,1410.0733784089005,1410.0733784089005,1542.2677576347348,1542.2677576347348,1542.2677576347348,16524.297403229302,null,null,3074.8867335120008,3214.6543123080005,3494.1894699000004,4193.0273638800008,{"$f":"V3-SUM(V4:V8)","v":13976.757879600002}]
["2020 TargetAfghanistan Revenue Department","Afghanistan Revenue Department",{"$f":"SUM(C11:C15)","v":8633.9676746301484},{"$f":"SUM(D11:D15)","v":8633.9676746301484},8633.9676746301484,9659.0049328054174,9659.0049328054174,9659.0049328054174,10092.674542033417,10092.674542033417,10092.674542033417,11038.862780349049,11038.862780349049,11038.862780349049,118273.5297894541]
{"$rows_left_out":125}