{"text_format":"1","workbook":"xlsx","n_sheets":5,"sheets":["Instructions","FY1398_YTD_Actual","Charts","Targets","Sheet1"],"not_rendered":{"charts":12,"images":0,"macros":1,"external_links":0,"defined_names":0,"comments":0,"pivot_tables":0},"unopened":[],"bounds":{"document_bytes":16777216,"sheet_cells":100000,"rows_first":2000,"rows_last":500,"rows_between":2000,"halvings":0,"cell_chars":16384,"cell_head_chars":4096},"cells_cut":0,"cells_raw":0,"read":"whole","date_system":"1900"}

{"sheet":"Instructions","index":0,"n_rows":15,"n_cols":4,"rows_kept":15,"cut":false,"hidden":false,"merged":[]}
[]
[]
[]
[]
[]
[null,null,null,"Instructions:"]
[]
[null,null,null,"1. Insert YTD actual data in yellow shaded area of YTD_Actual_Data sheet for each tax type and tax collectorate"]
[null,null,null,"2. Select charts for Page 1 using cell B2 to B5 and for Page 2 using cell B78 to B85 in Charts sheet"]
[null,null,null,"3. Pick a historical year other than previous year using cell B10 to compare against"]
{"$rows_left_out":6}
{"sheet":"FY1398_YTD_Actual","index":1,"n_rows":28,"n_cols":27,"rows_kept":28,"cut":false,"hidden":false,"merged":[[27,1,31,13],[27,0,31,0],[0,1,1,1],[0,2,1,2],[0,3,1,3],[0,4,1,4],[0,5,1,5],[0,6,1,6],[0,7,1,7],[0,8,1,8],[0,9,1,9],[0,10,1,10],[0,11,1,11],[0,12,1,12],[0,13,1,13],[0,0,1,0]]}
[{"$f":"Targets!C97","v":"Actual"},"M1","M2","M3","M4","M5","M6","M7","M8","M9","M10","M11","M12","Total"]
[]
[{"$f":"Targets!B3","v":"Customs Department"},{"$f":"SUM(B4:B9)","v":7123.0810760000004},{"$f":"SUM(C4:C9)","v":6626.5732660000003},{"$f":"SUM(D4:D9)","v":6314.7569809999995},{"$f":"SUM(E4:E9)","v":6445.0620420000005},{"$f":"SUM(F4:F9)","v":7098.8826709999994},{"$f":"SUM(G4:G9)","v":5924.7860890000002},{"$f":"SUM(H4:H9)","v":7041.8853359999994},{"$f":"SUM(I4:I9)","v":5530.6145350000006},{"$f":"SUM(J4:J9)","v":6318.4460160000008},{"$f":"SUM(K4:K9)","v":5822.3580750000001},{"$f":"SUM(L4:L9)","v":5744.8306900000007},{"$f":"SUM(M4:M9)","v":0},{"$f":"SUM(N4:N9)","v":69991.276776999992}]
[{"$f":"Targets!B4","v":"Herat Customs Office"},1669.9595830000001,1522.5356119999999,1639.1084519999999,1327.363441,1551.8118930000001,1535.7331200000001,1733.2997419999999,1321.997578,1433.4180120000001,1401.325681,1036.75,null,{"$f":"SUM(B4:M4)","v":16173.303114}]
[{"$f":"Targets!B5","v":"Nangarhar Customs Office"},1416.589154,1338.922474,1287.9711070000001,1511.7750450000001,1562.188742,1312.323695,1806.7935660000001,1284.9006569999999,1367.5865100000001,1148.300297,1526.5634460000001,null,15563.914693000001]
[{"$f":"Targets!B6","v":"Balkh Customs Office"},1004.925283,933.34220300000004,640.956549,859.62107900000001,753.63492199999996,826.19212900000002,686.91911700000003,692.38907800000004,810.13908300000003,710.695515,945.60215900000003,null,8864.4171170000009]
[{"$f":"Targets!B7","v":"Kandahar Customs Office"},1090.621171,994.10087999999996,825.19167800000002,900.81659300000001,1037.931151,744.32796900000005,964.12940800000001,710.60681299999999,904.97224100000005,983.86747600000001,864.56740000000002,null,10021.13278]
[{"$f":"Targets!B8","v":"Nimroz Customs Office"},700.63458600000001,743.74491,644.87630799999999,509.046626,701.49725599999999,468.37038000000001,655.09827399999995,435.39259399999997,561.27527499999997,528.04586200000006,512.73566300000005,null,6460.7177339999998]
[{"$f":"Targets!B9","v":"Other Customs Offices"},1240.3512989999999,1093.927187,1276.652887,1336.4392580000001,1491.8187069999999,1037.838796,1195.645229,1085.3278150000001,1241.054895,1050.1232440000001,858.61202200000002,0,12907.791338999999]
[{"$f":"Targets!B10","v":"Afghanistan Revenue Department"},{"$f":"SUM(B11:B15)","v":7355.1378109599991},{"$f":"SUM(C11:C15)","v":6885.9808951300001},7914.5748800000001,9076.6153532600001,15080.34019305,7341.4112163299997,8841.7891967300002,5703.1225351799994,8747.8818083900005,13894.00560006,5100.0155224199998,0,95940.875011509997]
{"$rows_left_out":19}
{"sheet":"Charts","index":2,"n_rows":113,"n_cols":55,"rows_kept":113,"cut":false,"hidden":false,"merged":[[76,0,76,1],[0,3,2,18],[73,3,76,18],[0,0,0,1],[3,3,3,18],[4,17,4,18]]}
["Select charts for page 1:",null,null,"Ministry of Finance",null,null,null,null,null,null,null,null,null,null,null,null,null,null,null,null,null,null,null,null,null,null,null,null,null,null,"M1","M2","M3","M4","M5","M6","M7","M8","M9","M10","M11","M12"]
["Figure 1:","Total Revenues",{"$f":"A2&\" \"&B2","v":"Figure 1: Total Revenues"},null,null,null,null,null,null,null,null,null,null,null,null,null,null,null,null,null,null,null,null,null,null,null,null,null,{"$f":"A2","v":"Figure 1:"},{"$f":"FY1398_YTD_Actual!$A$1","v":"Actual"},{"$f":"IF(INDEX(FY1398_YTD_Actual!B$3:B$19,MATCH($B$2,FY1398_YTD_Actual!$A$3:$A$19,0))=0,#N/A,INDEX(FY1398_YTD_Actual!B$3:B$19,MATCH($B$2,FY1398_YTD_Actual!$A$3:$A$19,0)))","v":14478.21888696},{"$f":"IF(INDEX(FY1398_YTD_Actual!C$3:C$19,MATCH($B$2,FY1398_YTD_Actual!$A$3:$A$19,0))=0,#N/A,INDEX(FY1398_YTD_Actual!C$3:C$19,MATCH($B$2,FY1398_YTD_Actual!$A$3:$A$19,0)))","v":13512.55416113},{"$f":"IF(INDEX(FY1398_YTD_Actual!D$3:D$19,MATCH($B$2,FY1398_YTD_Actual!$A$3:$A$19,0))=0,#N/A,INDEX(FY1398_YTD_Actual!D$3:D$19,MATCH($B$2,FY1398_YTD_Actual!$A$3:$A$19,0)))","v":14229.331860999999},{"$f":"IF(INDEX(FY1398_YTD_Actual!E$3:E$19,MATCH($B$2,FY1398_YTD_Actual!$A$3:$A$19,0))=0,#N/A,INDEX(FY1398_YTD_Actual!E$3:E$19,MATCH($B$2,FY1398_YTD_Actual!$A$3:$A$19,0)))","v":15521.677395260002},{"$f":"IF(INDEX(FY1398_YTD_Actual!F$3:F$19,MATCH($B$2,FY1398_YTD_Actual!$A$3:$A$19,0))=0,#N/A,INDEX(FY1398_YTD_Actual!F$3:F$19,MATCH($B$2,FY1398_YTD_Actual!$A$3:$A$19,0)))","v":22179.22286405},{"$f":"IF(INDEX(FY1398_YTD_Actual!G$3:G$19,MATCH($B$2,FY1398_YTD_Actual!$A$3:$A$19,0))=0,#N/A,INDEX(FY1398_YTD_Actual!G$3:G$19,MATCH($B$2,FY1398_YTD_Actual!$A$3:$A$19,0)))","v":13266.197305329999},{"$f":"IF(INDEX(FY1398_YTD_Actual!H$3:H$19,MATCH($B$2,FY1398_YTD_Actual!$A$3:$A$19,0))=0,#N/A,INDEX(FY1398_YTD_Actual!H$3:H$19,MATCH($B$2,FY1398_YTD_Actual!$A$3:$A$19,0)))","v":15883.67453273},{"$f":"IF(INDEX(FY1398_YTD_Actual!I$3:I$19,MATCH($B$2,FY1398_YTD_Actual!$A$3:$A$19,0))=0,#N/A,INDEX(FY1398_YTD_Actual!I$3:I$19,MATCH($B$2,FY1398_YTD_Actual!$A$3:$A$19,0)))","v":11233.737070179999},{"$f":"IF(INDEX(FY1398_YTD_Actual!J$3:J$19,MATCH($B$2,FY1398_YTD_Actual!$A$3:$A$19,0))=0,#N/A,INDEX(FY1398_YTD_Actual!J$3:J$19,MATCH($B$2,FY1398_YTD_Actual!$A$3:$A$19,0)))","v":15066.327824390002},{"$f":"IF(INDEX(FY1398_YTD_Actual!K$3:K$19,MATCH($B$2,FY1398_YTD_Actual!$A$3:$A$19,0))=0,#N/A,INDEX(FY1398_YTD_Actual!K$3:K$19,MATCH($B$2,FY1398_YTD_Actual!$A$3:$A$19,0)))","v":19716.363675059998},{"$f":"IF(INDEX(FY1398_YTD_Actual!L$3:L$19,MATCH($B$2,FY1398_YTD_Actual!$A$3:$A$19,0))=0,#N/A,INDEX(FY1398_YTD_Actual!L$3:L$19,MATCH($B$2,FY1398_YTD_Actual!$A$3:$A$19,0)))","v":10844.846212420001},{"$f":"IF(INDEX(FY1398_YTD_Actual!M$3:M$19,MATCH($B$2,FY1398_YTD_Actual!$A$3:$A$19,0))=0,#N/A,INDEX(FY1398_YTD_Actual!M$3:M$19,MATCH($B$2,FY1398_YTD_Actual!$A$3:$A$19,0)))","v":{"$error":"#N/A"}}]
["Figure 2:","Tax Revenues",{"$f":"A3&\" \"&B3","v":"Figure 2: Tax Revenues"},null,null,null,null,null,null,null,null,null,null,null,null,null,null,null,null,null,null,null,null,null,null,null,null,null,{"$f":"AD3&$B$2","v":"2019 TargetTotal Revenues"},{"$f":"Targets!$C$94","v":"2019 Target"},{"$f":"INDEX(Targets!C$3:C$41,MATCH(Charts!$AC3,Targets!$A$3:$A$41,0))","v":13787.151651240001},{"$f":"INDEX(Targets!D$3:D$41,MATCH(Charts!$AC3,Targets!$A$3:$A$41,0))","v":13787.151651240001},{"$f":"INDEX(Targets!E$3:E$41,MATCH(Charts!$AC3,Targets!$A$3:$A$41,0))","v":13787.151651240001},{"$f":"INDEX(Targets!F$3:F$41,MATCH(Charts!$AC3,Targets!$A$3:$A$41,0))","v":14413.840362660001},{"$f":"INDEX(Targets!G$3:G$41,MATCH(Charts!$AC3,Targets!$A$3:$A$41,0))","v":14413.840362660001},{"$f":"INDEX(Targets!H$3:H$41,MATCH(Charts!$AC3,Targets!$A$3:$A$41,0))","v":14413.840362660001},{"$f":"INDEX(Targets!I$3:I$41,MATCH(Charts!$AC3,Targets!$A$3:$A$41,0))","v":15667.217785499999},{"$f":"INDEX(Targets!J$3:J$41,MATCH(Charts!$AC3,Targets!$A$3:$A$41,0))","v":15667.217785499999},{"$f":"INDEX(Targets!K$3:K$41,MATCH(Charts!$AC3,Targets!$A$3:$A$41,0))","v":15667.217785499999},{"$f":"INDEX(Targets!L$3:L$41,MATCH(Charts!$AC3,Targets!$A$3:$A$41,0))","v":18800.6613426},{"$f":"INDEX(Targets!M$3:M$41,MATCH(Charts!$AC3,Targets!$A$3:$A$41,0))","v":18800.6613426},{"$f":"INDEX(Targets!N$3:N$41,MATCH(Charts!$AC3,Targets!$A$3:$A$41,0))","v":18800.6613426}]
["Figure 3:","Customs Revenues","Figure 3: Customs Revenues","YTD Revenue",null,null,null,null,null,null,null,null,null,null,null,null,null,null,null,null,null,null,null,null,null,null,null,1397,{"$f":"AD4&$B$2","v":"Previous Year performanceTotal Revenues"},{"$f":"Targets!$C$95","v":"Previous Year performance"},{"$f":"INDEX(Targets!C$3:C$41,MATCH(Charts!$AC4,Targets!$A$3:$A$41,0))","v":13348.76693858},{"$f":"INDEX(Targets!D$3:D$41,MATCH(Charts!$AC4,Targets!$A$3:$A$41,0))","v":10999.243230300001},{"$f":"INDEX(Targets!E$3:E$41,MATCH(Charts!$AC4,Targets!$A$3:$A$41,0))","v":13650.593742250003},{"$f":"INDEX(Targets!F$3:F$41,MATCH(Charts!$AC4,Targets!$A$3:$A$41,0))","v":14686.66936236},{"$f":"INDEX(Targets!G$3:G$41,MATCH(Charts!$AC4,Targets!$A$3:$A$41,0))","v":12807.166738650003},{"$f":"INDEX(Targets!H$3:H$41,MATCH(Charts!$AC4,Targets!$A$3:$A$41,0))","v":14782.170759150002},{"$f":"INDEX(Targets!I$3:I$41,MATCH(Charts!$AC4,Targets!$A$3:$A$41,0))","v":15668.385045409997},{"$f":"INDEX(Targets!J$3:J$41,MATCH(Charts!$AC4,Targets!$A$3:$A$41,0))","v":13039.181715610001},{"$f":"INDEX(Targets!K$3:K$41,MATCH(Charts!$AC4,Targets!$A$3:$A$41,0))","v":17418.140807399999},{"$f":"INDEX(Targets!L$3:L$41,MATCH(Charts!$AC4,Targets!$A$3:$A$41,0))","v":16627.180508329999},{"$f":"INDEX(Targets!M$3:M$41,MATCH(Charts!$AC4,Targets!$A$3:$A$41,0))","v":23474.579389230003},{"$f":"INDEX(Targets!N$3:N$41,MATCH(Charts!$AC4,Targets!$A$3:$A$41,0))","v":23059.695462459997}]
["Figure 4:","Non-tax Revenues","Figure 4: Non-tax Revenues","Date:",{"$f":"B12","v":"2019-11-17"},null,null,null,null,null,null,null,null,null,null,null,"Source:","RMIS",null,null,null,null,null,null,null,null,null,null,null,"Cummulative"]
[null,null,{"$f":"#REF!&\" \"&#REF!","v":{"$error":"#REF!"}},null,null,null,null,null,null,null,null,null,null,null,null,null,null,null,null,null,null,null,null,null,null,null,null,null,null,{"$f":"AD2","v":"Actual"},14478.21888696,{"$f":"SUM($AE2:AF2)","v":27990.773048089999},{"$f":"SUM($AE2:AG2)","v":42220.104909089998},{"$f":"SUM($AE2:AH2)","v":57741.782304349996},{"$f":"SUM($AE2:AI2)","v":79921.005168399992},{"$f":"SUM($AE2:AJ2)","v":93187.202473729994},{"$f":"SUM($AE2:AK2)","v":109070.87700646},{"$f":"SUM($AE2:AL2)","v":120304.61407663999},{"$f":"SUM($AE2:AM2)","v":135370.94190102999},{"$f":"SUM($AE2:AN2)","v":155087.30557609},{"$f":"SUM($AE2:AO2)","v":165932.15178851},{"$f":"SUM($AE2:AP2)","v":{"$error":"#N/A"}},"Flag if any",{"$f":"IF((1-AE6/AE7)>$B$11,AE6,#N/A)","v":{"$error":"#N/A"}},{"$error":"#N/A"},{"$error":"#N/A"},{"$error":"#N/A"},{"$error":"#N/A"},{"$error":"#N/A"},{"$error":"#N/A"},{"$error":"#N/A"},{"$error":"#N/A"},{"$error":"#N/A"},{"$error":"#N/A"},{"$error":"#N/A"}]
[null,null,{"$f":"A5&\" \"&B5","v":"Figure 4: Non-tax Revenues"},null,null,null,null,null,null,null,null,null,null,null,null,null,null,null,null,null,null,null,null,null,null,null,null,null,null,"2019 Target",13787.151651240001,{"$f":"SUM($AE3:AF3)","v":27574.303302480002},{"$f":"SUM($AE3:AG3)","v":41361.454953720007},{"$f":"SUM($AE3:AH3)","v":55775.295316380012},{"$f":"SUM($AE3:AI3)","v":70189.135679040017},{"$f":"SUM($AE3:AJ3)","v":84602.976041700022},{"$f":"SUM($AE3:AK3)","v":100270.19382720003},{"$f":"SUM($AE3:AL3)","v":115937.41161270003},{"$f":"SUM($AE3:AM3)","v":131604.62939820002},{"$f":"SUM($AE3:AN3)","v":150405.29074080003},{"$f":"SUM($AE3:AO3)","v":169205.95208340004},{"$f":"SUM($AE3:AP3)","v":188006.61342600005},"Historical Year Performance",{"$f":"INDEX(Targets!Q$49:Q$88,MATCH(Charts!$AQ8,Targets!$A$49:$A$88,0))","v":10450},{"$f":"INDEX(Targets!R$49:R$88,MATCH(Charts!$AQ8,Targets!$A$49:$A$88,0))","v":20620},{"$f":"INDEX(Targets!S$49:S$88,MATCH(Charts!$AQ8,Targets!$A$49:$A$88,0))","v":32249},{"$f":"INDEX(Targets!T$49:T$88,MATCH(Charts!$AQ8,Targets!$A$49:$A$88,0))","v":45155},{"$f":"INDEX(Targets!U$49:U$88,MATCH(Charts!$AQ8,Targets!$A$49:$A$88,0))","v":56611},{"$f":"INDEX(Targets!V$49:V$88,MATCH(Charts!$AQ8,Targets!$A$49:$A$88,0))","v":80027},{"$f":"INDEX(Targets!W$49:W$88,MATCH(Charts!$AQ8,Targets!$A$49:$A$88,0))","v":91418},{"$f":"INDEX(Targets!X$49:X$88,MATCH(Charts!$AQ8,Targets!$A$49:$A$88,0))","v":104859},{"$f":"INDEX(Targets!Y$49:Y$88,MATCH(Charts!$AQ8,Targets!$A$49:$A$88,0))","v":114426},{"$f":"INDEX(Targets!Z$49:Z$88,MATCH(Charts!$AQ8,Targets!$A$49:$A$88,0))","v":125355},{"$f":"INDEX(Targets!AA$49:AA$88,MATCH(Charts!$AQ8,Targets!$A$49:$A$88,0))","v":139116},{"$f":"INDEX(Targets!AB$49:AB$88,MATCH(Charts!$AQ8,Targets!$A$49:$A$88,0))","v":153496}]
[null,null,{"$f":"#REF!&\" \"&#REF!","v":{"$error":"#REF!"}},null,null,null,null,null,null,null,null,null,null,null,null,null,null,null,null,null,null,null,null,null,null,null,null,null,null,"Previous Year performance",13348.76693858,{"$f":"SUM($AE4:AF4)","v":24348.010168879999},{"$f":"SUM($AE4:AG4)","v":37998.603911130005},{"$f":"SUM($AE4:AH4)","v":52685.273273490006},{"$f":"SUM($AE4:AI4)","v":65492.44001214001},{"$f":"SUM($AE4:AJ4)","v":80274.610771290012},{"$f":"SUM($AE4:AK4)","v":95942.995816700015},{"$f":"SUM($AE4:AL4)","v":108982.17753231002},{"$f":"SUM($AE4:AM4)","v":126400.31833971001},{"$f":"SUM($AE4:AN4)","v":143027.49884804001},{"$f":"SUM($AE4:AO4)","v":166502.07823727001},{"$f":"SUM($AE4:AP4)","v":189561.77369972999},{"$f":"$B$10&$B$2","v":"FY1395Total Revenues"}]
[null,null,null,null,null,null,null,null,null,null,null,null,null,null,null,null,null,null,null,null,null,null,null,null,null,null,null,null,{"$f":"#REF!","v":{"$error":"#REF!"}},{"$f":"FY1398_YTD_Actual!$A$1","v":"Actual"},{"$f":"IF(INDEX(FY1398_YTD_Actual!B$3:B$19,MATCH($B$3,FY1398_YTD_Actual!$A$3:$A$19,0))=0,#N/A,INDEX(FY1398_YTD_Actual!B$3:B$19,MATCH($B$3,FY1398_YTD_Actual!$A$3:$A$19,0)))","v":7586.4583301599996},{"$f":"IF(INDEX(FY1398_YTD_Actual!C$3:C$19,MATCH($B$2,FY1398_YTD_Actual!$A$3:$A$19,0))=0,#N/A,INDEX(FY1398_YTD_Actual!C$3:C$19,MATCH($B$2,FY1398_YTD_Actual!$A$3:$A$19,0)))","v":13512.55416113},{"$f":"IF(INDEX(FY1398_YTD_Actual!D$3:D$19,MATCH($B$2,FY1398_YTD_Actual!$A$3:$A$19,0))=0,#N/A,INDEX(FY1398_YTD_Actual!D$3:D$19,MATCH($B$2,FY1398_YTD_Actual!$A$3:$A$19,0)))","v":14229.331860999999},{"$f":"IF(INDEX(FY1398_YTD_Actual!E$3:E$19,MATCH($B$2,FY1398_YTD_Actual!$A$3:$A$19,0))=0,#N/A,INDEX(FY1398_YTD_Actual!E$3:E$19,MATCH($B$2,FY1398_YTD_Actual!$A$3:$A$19,0)))","v":15521.677395260002},{"$f":"IF(INDEX(FY1398_YTD_Actual!F$3:F$19,MATCH($B$2,FY1398_YTD_Actual!$A$3:$A$19,0))=0,#N/A,INDEX(FY1398_YTD_Actual!F$3:F$19,MATCH($B$2,FY1398_YTD_Actual!$A$3:$A$19,0)))","v":22179.22286405},{"$f":"IF(INDEX(FY1398_YTD_Actual!G$3:G$19,MATCH($B$2,FY1398_YTD_Actual!$A$3:$A$19,0))=0,#N/A,INDEX(FY1398_YTD_Actual!G$3:G$19,MATCH($B$2,FY1398_YTD_Actual!$A$3:$A$19,0)))","v":13266.197305329999},{"$f":"IF(INDEX(FY1398_YTD_Actual!H$3:H$19,MATCH($B$2,FY1398_YTD_Actual!$A$3:$A$19,0))=0,#N/A,INDEX(FY1398_YTD_Actual!H$3:H$19,MATCH($B$2,FY1398_YTD_Actual!$A$3:$A$19,0)))","v":15883.67453273},{"$f":"IF(INDEX(FY1398_YTD_Actual!I$3:I$19,MATCH($B$2,FY1398_YTD_Actual!$A$3:$A$19,0))=0,#N/A,INDEX(FY1398_YTD_Actual!I$3:I$19,MATCH($B$2,FY1398_YTD_Actual!$A$3:$A$19,0)))","v":11233.737070179999},{"$f":"IF(INDEX(FY1398_YTD_Actual!J$3:J$19,MATCH($B$2,FY1398_YTD_Actual!$A$3:$A$19,0))=0,#N/A,INDEX(FY1398_YTD_Actual!J$3:J$19,MATCH($B$2,FY1398_YTD_Actual!$A$3:$A$19,0)))","v":15066.327824390002},{"$f":"IF(INDEX(FY1398_YTD_Actual!K$3:K$19,MATCH($B$2,FY1398_YTD_Actual!$A$3:$A$19,0))=0,#N/A,INDEX(FY1398_YTD_Actual!K$3:K$19,MATCH($B$2,FY1398_YTD_Actual!$A$3:$A$19,0)))","v":19716.363675059998},{"$f":"IF(INDEX(FY1398_YTD_Actual!L$3:L$19,MATCH($B$2,FY1398_YTD_Actual!$A$3:$A$19,0))=0,#N/A,INDEX(FY1398_YTD_Actual!L$3:L$19,MATCH($B$2,FY1398_YTD_Actual!$A$3:$A$19,0)))","v":10844.846212420001},{"$f":"IF(INDEX(FY1398_YTD_Actual!M$3:M$19,MATCH($B$2,FY1398_YTD_Actual!$A$3:$A$19,0))=0,#N/A,INDEX(FY1398_YTD_Actual!M$3:M$19,MATCH($B$2,FY1398_YTD_Actual!$A$3:$A$19,0)))","v":{"$error":"#N/A"}},{"$f":"IFERROR(IF(AR9=\"#N/A\",\"\",\"AFMIS\"),\"\")","v":"AFMIS"},{"$f":"INDEX(FY1398_YTD_Actual!P25,MATCH(Charts!$B$2,FY1398_YTD_Actual!$A$25,0))","v":14490},{"$f":"INDEX(FY1398_YTD_Actual!Q25,MATCH(Charts!$B$2,FY1398_YTD_Actual!$A$25,0))","v":28150},{"$f":"INDEX(FY1398_YTD_Actual!R25,MATCH(Charts!$B$2,FY1398_YTD_Actual!$A$25,0))","v":42420},{"$f":"INDEX(FY1398_YTD_Actual!S25,MATCH(Charts!$B$2,FY1398_YTD_Actual!$A$25,0))","v":57970},{"$f":"INDEX(FY1398_YTD_Actual!T25,MATCH(Charts!$B$2,FY1398_YTD_Actual!$A$25,0))","v":80240},{"$f":"INDEX(FY1398_YTD_Actual!U25,MATCH(Charts!$B$2,FY1398_YTD_Actual!$A$25,0))","v":93630},{"$f":"INDEX(FY1398_YTD_Actual!V25,MATCH(Charts!$B$2,FY1398_YTD_Actual!$A$25,0))","v":109420},{"$f":"INDEX(FY1398_YTD_Actual!W25,MATCH(Charts!$B$2,FY1398_YTD_Actual!$A$25,0))","v":120810},{"$f":"INDEX(FY1398_YTD_Actual!X25,MATCH(Charts!$B$2,FY1398_YTD_Actual!$A$25,0))","v":136040},{"$f":"INDEX(FY1398_YTD_Actual!Y25,MATCH(Charts!$B$2,FY1398_YTD_Actual!$A$25,0))","v":156200},{"$f":"INDEX(FY1398_YTD_Actual!Z25,MATCH(Charts!$B$2,FY1398_YTD_Actual!$A$25,0))","v":167850},{"$f":"INDEX(FY1398_YTD_Actual!AA25,MATCH(Charts!$B$2,FY1398_YTD_Actual!$A$25,0))","v":{"$error":"#N/A"}}]
["Historical Year Comparison","FY1395",null,null,null,null,null,null,null,null,null,null,null,null,null,null,null,null,null,null,null,null,null,null,null,null,null,null,{"$f":"AD10&#REF!","v":{"$error":"#REF!"}},{"$f":"Targets!$C$94","v":"2019 Target"},{"$f":"INDEX(Targets!C$3:C$41,MATCH(Charts!$AC10,Targets!$A$3:$A$41,0))","v":{"$error":"#REF!"}},{"$f":"INDEX(Targets!D$3:D$41,MATCH(Charts!$AC10,Targets!$A$3:$A$41,0))","v":{"$error":"#REF!"}},{"$f":"INDEX(Targets!E$3:E$41,MATCH(Charts!$AC10,Targets!$A$3:$A$41,0))","v":{"$error":"#REF!"}},{"$f":"INDEX(Targets!F$3:F$41,MATCH(Charts!$AC10,Targets!$A$3:$A$41,0))","v":{"$error":"#REF!"}},{"$f":"INDEX(Targets!G$3:G$41,MATCH(Charts!$AC10,Targets!$A$3:$A$41,0))","v":{"$error":"#REF!"}},{"$f":"INDEX(Targets!H$3:H$41,MATCH(Charts!$AC10,Targets!$A$3:$A$41,0))","v":{"$error":"#REF!"}},{"$f":"INDEX(Targets!I$3:I$41,MATCH(Charts!$AC10,Targets!$A$3:$A$41,0))","v":{"$error":"#REF!"}},{"$f":"INDEX(Targets!J$3:J$41,MATCH(Charts!$AC10,Targets!$A$3:$A$41,0))","v":{"$error":"#REF!"}},{"$f":"INDEX(Targets!K$3:K$41,MATCH(Charts!$AC10,Targets!$A$3:$A$41,0))","v":{"$error":"#REF!"}},{"$f":"INDEX(Targets!L$3:L$41,MATCH(Charts!$AC10,Targets!$A$3:$A$41,0))","v":{"$error":"#REF!"}},{"$f":"INDEX(Targets!M$3:M$41,MATCH(Charts!$AC10,Targets!$A$3:$A$41,0))","v":{"$error":"#REF!"}},{"$f":"INDEX(Targets!N$3:N$41,MATCH(Charts!$AC10,Targets!$A$3:$A$41,0))","v":{"$error":"#REF!"}}]
{"$rows_left_out":104}
{"sheet":"Targets","index":3,"n_rows":114,"n_cols":28,"rows_kept":114,"cut":false,"hidden":false,"merged":[[93,0,106,0],[107,0,109,0],[22,2,22,13],[0,2,0,13]]}
[null,null,{"$f":"B2","v":"2019 Target"},null,null,null,null,null,null,null,null,null,null,null,null,null,null,22,23,25,30]
[null,{"$f":"C94","v":"2019 Target"},"M1","M2","M3","M4","M5","M6","M7","M8","M9","M10","M11","M12","Total",null,null,"Q1","Q2","Q3","Q4","Budget Target"]
[{"$f":"$B$2&B3","v":"2019 TargetCustoms Department"},{"$f":"B94","v":"Customs Department"},{"$f":"SUM(C4:C9)","v":5896.9326879246673},{"$f":"SUM(D4:D9)","v":5896.9326879246673},5896.9326879246673,6164.975082830334,6164.975082830334,6164.975082830334,6701.0598726416665,6701.0598726416665,6701.0598726416665,8041.27184717,8041.27184717,8041.27184717,{"$f":"SUM(C3:N3)","v":80412.718471700005},null,null,{"$f":"$V3*R$1/100","v":17690.798063774},{"$f":"$V3*S$1/100","v":18494.925248490999},20103.179617925001,24123.815541510001,80412.718471700005]
[{"$f":"$B$2&B4","v":"2019 TargetHerat Customs Office"},{"$f":"B95","v":"Herat Customs Office"},{"$f":"$R4/3","v":1600.3624289106667},{"$f":"$R4/3","v":1600.3624289106667},1600.3624289106667,{"$f":"$S4/3","v":1673.1061756793333},{"$f":"$S4/3","v":1673.1061756793333},1673.1061756793333,{"$f":"$T4/3","v":1818.5936692166667},{"$f":"$T4/3","v":1818.5936692166667},1818.5936692166667,{"$f":"$U4/3","v":2182.3124030599997},{"$f":"$U4/3","v":2182.3124030599997},2182.3124030599997,21823.124030600004,null,null,{"$f":"$V4*R$1/100","v":4801.0872867320004},5019.318527038,5455.78100765,6546.9372091799996,21823.1240306]
["2019 TargetNangarhar Customs Office","Nangarhar Customs Office",{"$f":"$R5/3","v":1271.8525085933331},1271.8525085933331,1271.8525085933331,{"$f":"$S5/3","v":1329.6639862566667},1329.6639862566667,1329.6639862566667,{"$f":"$T5/3","v":1445.2869415833331},1445.2869415833331,1445.2869415833331,{"$f":"$U5/3","v":1734.3443298999998},1734.3443298999998,1734.3443298999998,17343.443298999999,null,null,3815.5575257799997,3988.9919587700001,4335.8608247499997,5203.0329896999992,17343.443298999999]
["2019 TargetBalkh Customs Office","Balkh Customs Office",923.27621582533322,923.27621582533322,923.27621582533322,965.24331654466675,965.24331654466675,965.24331654466675,1049.1775179833332,1049.1775179833332,1049.1775179833332,1259.01302158,1259.01302158,1259.01302158,12590.1302158,null,null,2769.8286474759998,2895.7299496340001,3147.53255395,3777.03906474,12590.1302158]
["2019 TargetKandahar Customs Office","Kandahar Customs Office",546.30100098933337,546.30100098933337,546.30100098933337,571.13286467066666,571.13286467066666,571.13286467066666,620.79659203333335,620.79659203333335,620.79659203333335,744.95591044000003,744.95591044000003,744.95591044000003,7449.5591043999993,null,null,1638.903002968,1713.3985940119999,1862.3897761000001,2234.8677313200001,7449.5591044000003]
["2019 TargetNimroz Customs Office","Nimroz Customs Office",530.17828910199989,530.17828910199989,530.17828910199989,554.27730224300001,554.27730224300001,554.27730224300001,602.47532852500001,602.47532852500001,602.47532852500001,722.9703942299999,722.9703942299999,722.9703942299999,7229.7039423000006,null,null,1590.5348673059998,1662.8319067290001,1807.4259855749999,2168.9111826899998,7229.7039422999997]
["2019 TargetOther Customs Offices","Other Customs Offices",1024.9622445040002,1024.9622445040002,1024.9622445040002,1071.5514374360002,1071.5514374360002,1071.5514374360002,1164.7298233000001,1164.7298233000001,1164.7298233000001,1397.6757879600002,1397.6757879600002,1397.6757879600002,13976.757879600003,null,null,3074.8867335120008,3214.6543123080005,3494.1894699000004,4193.0273638800008,{"$f":"V3-SUM(V4:V8)","v":13976.757879600002}]
["2019 TargetAfghanistan Revenue Department","Afghanistan Revenue Department",{"$f":"SUM(C11:C15)","v":7890.2189633153339},{"$f":"SUM(D11:D15)","v":7890.2189633153339},7890.2189633153339,8248.8652798296662,8248.8652798296662,8248.8652798296662,8966.1579128583326,8966.1579128583326,8966.1579128583326,10759.389495430001,10759.389495430001,10759.389495430001,107593.89495430001]
{"$rows_left_out":105}
{"sheet":"Sheet1","index":4,"n_rows":21,"n_cols":17,"rows_kept":21,"cut":false,"hidden":false,"merged":[]}
[]
[]
[]
[]
[]
[]
[]
[]
[]
[]
{"$rows_left_out":11}